{"text_format":"1","workbook":"xlsx","n_sheets":14,"sheets":["How to use","FEEDCHECKER","CUSTOM FEED SET-UP","   ASK    ","OBSERVE","ASSESS & COMPARE","SUMMARISE 2","SUMMARISE","Not so QUICK CHECK","Extra info","Sheet2","Data source","Drop down list set up","Sheet1"],"not_rendered":{"charts":0,"images":30,"macros":1,"external_links":0,"defined_names":39,"comments":3,"pivot_tables":0},"unopened":[],"bounds":{"document_bytes":16777216,"sheet_cells":100000,"rows_first":2000,"rows_last":500,"rows_between":2000,"halvings":0,"cell_chars":16384,"cell_head_chars":4096},"cells_cut":0,"cells_raw":0,"read":"whole","date_system":"1900"}

{"sheet":"How to use","index":0,"n_rows":19,"n_cols":9,"rows_kept":19,"cut":false,"hidden":false,"merged":[[1,2,2,22],[8,2,8,21],[5,2,5,21],[9,2,9,21],[30,23,31,31],[46,23,47,31],[48,22,51,30],[74,24,75,36],[102,24,103,36],[58,28,59,36],[62,30,63,38],[71,24,72,36],[68,24,69,36]]}
[]
[null,null,"Note: FEEDCHECKER has been prepared with due care. Results, however, will vary from situation to situation and outputs should be viewed as estimates. This information is intended as a general guide and a tool to support feed management decisions. DairyNZ accepts no liability for decisions made based on this information."]
[]
[]
[null,null,"Who is the FEEDCHECKER spreadsheet targetted at? "]
[null,null,"This tool has been developed to enable farmers and their advisors to assess current and proposed diets."]
[]
[null,null,"What does FEEDCHECKER do?"]
[null,null,"FeedChecker estimates the energy and nutrient demands for a selected mob of cows and compares this with what is supplied in the diet.  FeedChecker will determine if the diets offered meet energy and nutrient requirements and can determine the cost of these different diets. However, it does not calculate any change to revenue.  To determine the expected margin from feeding different supplements use the supplement price calculator  http://www.dairynz.co.nz/feed/feed-management-tools/supplement-price-calculator"]
[]
[null,null,"FEEDCHECKER"]
[]
[]
[]
[null,null,null,null,null,null,null,null,"Click on the green drop down boxes and a list of options will appear "]
[]
[]
[null,null,null,null,null,null,null,null,"If a red square appears, the value is outside recommended range. An orange square indicates the value is in excess of requirements (e.g. energy).   Note FeedChecker does not calculate the most economic diet. Refer to the Supplement Price Calculator ."]
[null,null,null,null,null,null,null,null,"The information symbol will appear when there is extra relevant information or instructions to follow"]

{"sheet":"FEEDCHECKER","index":1,"n_rows":93,"n_cols":99,"rows_kept":93,"cut":false,"hidden":false,"merged":[[69,14,70,14],[40,1,41,1],[43,1,44,1],[49,2,50,2],[40,7,41,8],[52,12,53,12],[43,7,44,8],[52,10,53,10],[46,10,47,10],[40,10,41,10],[52,9,53,9],[40,9,41,9],[43,9,44,9],[46,1,47,1],[52,1,53,1],[52,2,53,2],[67,14,68,14],[55,14,56,14],[67,12,68,12],[40,12,41,12],[43,12,44,12],[46,14,47,14],[49,14,50,14],[58,10,59,10],[39,46,40,46],[42,46,43,46],[33,21,34,30],[36,22,36,24],[40,23,41,23],[43,23,44,23],[40,22,41,22],[66,46,67,46],[54,40,55,40],[54,43,55,43],[51,39,52,39],[54,39,55,39],[57,39,58,39],[48,37,49,37],[48,36,49,36],[57,37,58,37],[57,42,58,42],[60,42,61,42],[36,46,37,46],[60,37,61,37],[60,40,61,40],[60,43,61,43],[48,43,49,43],[60,36,61,36],[34,48,34,52],[34,54,34,63],[36,54,36,55],[36,56,36,57],[36,58,36,59],[36,60,36,61],[36,62,36,63],[34,42,34,43],[34,75,34,78],[71,36,71,37],[69,42,69,43],[69,39,69,40],[70,22,71,22],[70,23,71,23],[70,26,71,26],[70,28,71,28],[64,22,65,22],[64,23,65,23],[70,24,71,24],[66,37,67,37],[66,40,67,40],[66,43,67,43],[66,39,67,39],[66,36,67,36],[63,39,64,39],[73,22,74,22],[84,27,85,27],[81,23,82,23],[89,22,89,27],[92,22,93,22],[92,23,93,23],[92,25,93,25],[92,26,93,26],[92,28,93,28],[81,26,82,26],[81,28,82,28],[84,22,85,22],[84,23,85,23],[84,25,85,25],[84,26,85,26],[73,23,74,23],[84,24,85,24],[86,24,87,24],[81,24,82,24],[79,24,80,24],[76,24,77,24],[73,24,74,24],[86,23,87,23],[86,26,87,26],[86,28,87,28],[76,22,77,22],[76,23,77,23],[76,25,77,25],[76,26,77,26],[76,28,77,28],[79,22,80,22],[79,23,80,23],[79,25,80,25],[79,26,80,26],[79,28,80,28],[79,27,80,27],[63,46,64,46],[51,46,52,46],[54,46,55,46],[57,46,58,46],[60,46,61,46],[57,36,58,36],[63,43,64,43],[64,24,65,24],[64,28,65,28],[64,27,65,27],[58,29,59,29],[64,25,65,25],[54,42,55,42],[54,36,55,36],[45,46,46,46],[45,39,46,39],[45,43,46,43],[54,37,55,37],[49,25,50,25],[49,26,50,26],[49,27,50,27],[49,28,50,28],[48,46,49,46],[48,40,49,40],[48,42,49,42],[48,39,49,39],[55,28,56,28],[55,29,56,29],[52,25,53,25],[52,26,53,26],[52,27,53,27],[52,28,53,28],[49,29,50,29],[55,25,56,25],[55,26,56,26],[55,27,56,27],[48,95,48,96],[5,2,5,6],[67,4,68,5],[46,2,47,2],[67,7,68,8],[6,2,6,6],[7,2,7,6],[64,4,65,5],[40,2,41,2],[43,2,44,2],[64,2,65,2],[61,2,62,2],[40,4,41,5],[43,4,44,5],[57,40,58,40],[57,43,58,43],[52,14,53,14],[51,42,52,42],[51,36,52,36],[52,16,53,16],[55,16,56,16],[58,16,59,16],[61,16,62,16],[32,35,32,38],[45,98,45,99],[46,4,47,5],[58,4,59,5],[61,4,62,5],[45,92,45,93],[45,95,45,96],[55,7,56,8],[54,92,54,93],[54,95,54,96],[54,98,54,99],[52,7,53,8],[51,92,51,93],[51,95,51,96],[51,98,51,99],[49,7,50,8],[48,98,48,99],[46,7,47,8],[58,7,59,8],[55,4,56,5],[52,4,53,5],[49,4,50,5],[48,92,48,93],[61,7,62,8],[60,39,61,39],[10,73,10,74],[8,2,8,6],[9,2,9,6],[35,10,35,12],[35,14,35,16],[14,4,14,7],[37,9,38,9],[37,12,38,12],[36,43,37,43],[37,2,38,2],[37,7,38,8],[37,4,38,5],[37,10,38,10],[36,39,37,39],[37,14,38,14],[36,42,37,42],[12,1,12,7],[37,16,38,16],[36,37,37,37],[36,40,37,40],[36,36,37,36],[34,39,34,40],[34,65,34,71],[34,35,34,38],[75,41,76,41],[75,42,76,42],[75,43,76,43],[40,16,41,16],[43,16,44,16],[46,16,47,16],[49,16,50,16],[45,42,46,42],[45,36,46,36],[45,37,46,37],[45,40,46,40],[46,26,47,26],[46,27,47,27],[46,28,47,28],[46,29,47,29],[49,22,50,22],[49,23,50,23],[71,42,71,43],[42,43,43,43],[63,37,64,37],[63,40,64,40],[51,37,52,37],[51,40,52,40],[69,16,70,16],[69,12,70,12],[64,14,65,14],[55,10,56,10],[72,39,72,40],[74,39,74,43],[72,42,72,43],[42,39,43,39],[42,42,43,42],[42,36,43,36],[42,37,43,37],[42,40,43,40],[43,26,44,26],[43,27,44,27],[43,29,44,29],[43,28,44,28],[71,39,71,40],[64,29,65,29],[51,43,52,43],[63,42,64,42],[66,42,67,42],[63,36,64,36],[58,28,59,28],[67,23,68,23],[72,36,72,37],[71,4,71,8],[69,10,70,10],[64,1,65,1],[61,10,62,10],[64,10,65,10],[67,10,68,10],[61,1,62,1],[67,1,68,1],[67,2,68,2],[67,9,68,9],[61,3,62,3],[64,3,65,3],[67,3,68,3],[71,2,72,2],[61,9,62,9],[64,9,65,9],[72,4,72,8],[64,7,65,8],[46,23,47,23],[15,22,15,28],[16,22,16,29],[43,22,44,22],[64,16,65,16],[67,16,68,16],[55,22,56,22],[67,22,68,22],[58,26,59,26],[58,27,59,27],[58,22,59,22],[52,29,53,29],[52,23,53,23],[58,23,59,23],[58,25,59,25],[67,24,68,24],[64,26,65,26],[52,22,53,22],[55,23,56,23],[40,24,41,24],[43,24,44,24],[1,4,1,7],[49,3,50,3],[46,3,47,3],[43,3,44,3],[4,1,4,7],[58,1,59,1],[55,1,56,1],[55,2,56,2],[43,14,44,14],[46,9,47,9],[49,9,50,9],[58,12,59,12],[46,12,47,12],[17,14,18,14],[24,1,24,7],[55,3,56,3],[58,3,59,3],[40,14,41,14],[2,13,2,15],[49,1,50,1],[1,2,1,3],[19,9,19,12],[43,10,44,10],[49,10,50,10],[61,12,62,12],[64,12,65,12],[52,3,53,3],[27,12,27,16],[55,9,56,9],[58,9,59,9],[58,2,59,2],[2,4,2,5],[79,29,80,29],[58,14,59,14],[61,14,62,14],[49,12,50,12],[55,12,56,12],[46,24,47,24],[40,26,41,26],[40,27,41,27],[40,28,41,28],[40,29,41,29],[37,3,38,3],[37,6,38,6],[2,28,2,29],[18,22,18,24],[14,22,14,28],[46,22,47,22],[84,29,85,29],[73,25,74,25],[70,25,71,25],[67,25,68,25],[67,27,68,27],[70,27,71,27],[73,27,74,27],[76,27,77,27],[67,29,68,29],[70,29,71,29],[73,29,74,29],[73,26,74,26],[73,28,74,28],[84,28,85,28],[67,26,68,26],[67,28,68,28]]}
[]
[null,null,"NAME "]
[null,null,null,"Calcs from Today ",{"$f":"TODAY()","v":"2022-12-06"},null,null,null,null,null,"Calcs from a different date?",null,null,null,null,null,{"$f":"IF(I4=\"\",\"i\",\"\")","v":"i"},null,null,null,null,null,"ENERGY REQUIREMENTS",null,null,null,null,null,"MJME/cow",null,null,null,null,null,null,null,null,null,null,null,null,null,null,null,null,null,null,null,null,null,null,null,null,null,null,null,null,null,null,null,null,null,null,null,null,null,null,null,null,null,null,null,null,null,null,null,null,null,null,null,null,null,null,null,null,null,null,null,null,null,null,null,null,null,"Cell",null,"Option 1",null,"Option 2"]
[null,null,null,null,null,null,null,null,null,null,null,null,null,null,null,null,null,null,null,null,null,null,"maintenance",null,null,null,null,null,null,{"$f":"IF($H$8=\"\",\"\",VLOOKUP($H$8,'Data source'!$B$190:$C$199,2,FALSE))","v":""},null,null,null,null,null,null,null,null,null,null,null,null,null,null,null,null,null,null,null,null,null,null,null,null,null,null,null,null,null,null,null,null,null,null,null,null,null,null,null,null,null,null,null,null,null,null,null,null,null,null,null,null,null,null,null,null,null,null,null,null,null,null,null,null,"AB42 & AD42","Average ME of diet (MJ ME)",{"$f":"IF(OR($AA$44=\"\",$AA41=\"\"),11,$AA$44/$AA41)","v":11},null,{"$f":"IF(OR($AC$44=\"\",$AC41=\"\"),11,$AC$44/$AC41)","v":11}]
[null,"1. HERD/MOB INPUTS",null,null,null,null,null,null,null,null,null,null,null,null,null,null,null,null,null,null,null,null,"total MS production",null,null,null,null,null,null,{"$f":"IF($H$7=\"Dry\",0,IF(OR($H$6=\"\",$O$7=\"\"),\"\",$O$7*$CJ$11))","v":""},null,null,null,null,null,null,null,null,null,null,null,null,null,null,null,null,null,null,null,null,null,null,null,null,null,null,null,null,null,null,null,null,null,null,null,null,null,null,null,null,null,null,null,null,null,null,null,null,null,null,null,null,null,null,null,null,"Energy requirements calcs",null,null,null,null,null,null,null,"Y40 & Z40","Total DMI requirements (kg DM)",{"$f":"IF(OR($AD$11=\"\",CS4=\"\"),\"\",$AD$11/$CS$4)","v":""},null,{"$f":"IF(OR($AE$11=\"\",CU4=\"\"),\"\",$AE$11/$CU$4)","v":""}]
[null,null,"Breed",null,null,null,null,null,null,"Cows in mob",null,null,null,null,null,null,null,null,null,null,null,null,"daily BCS gain/loss",null,null,null,null,null,null,{"$f":"IF(OR($H$7=\"\",$H$8=\"\",$H$9=\"\"),\"\",IF($H$9<0,$CO$8,IF($H$9>0,$CO$9,0)))","v":""},null,null,null,null,null,null,null,null,null,null,null,null,null,null,null,null,null,null,null,null,null,null,null,null,null,null,null,null,null,null,null,null,null,null,null,null,null,null,null,null,null,null,null,null,null,null,null,null,null,null,null,null,null,null,null,"Cell",null,"Option 1","Option 2",null,null,null,"Option 1","Option 2","AC43 & AE43","Difference in ME  intake (MJ)",{"$f":"IF(OR(AA$44=\"\",$AD$11=\"\"),\"\",AA$44-$AD$11)","v":""},null,{"$f":"IF(OR(AC$44=\"\",$AE$11=\"\"),\"\",AC$44-CU9)","v":""}]
[null,null,"Stage of lactation",null,null,null,null,null,null,"Milk solids (kg MS/cow/day)",null,null,null,null,null,null,{"$f":"IF($H$7=\"Dry\",IF($O$7>0,\"Check MS\",\"\"),IF(OR($O$7<0.3,$O$7>3),\"Check MS\",\"\"))","v":"Check MS"},null,null,null,null,null,"pregnancy",null,null,null,null,null,null,{"$f":"IF($O$10=\"Enter PSC\",\"\",$CJ$12)","v":0},null,null,null,null,null,null,null,null,null,null,null,null,null,null,null,null,null,null,null,null,null,null,null,null,null,null,null,null,null,null,null,null,null,null,null,null,null,null,null,null,null,null,null,null,null,null,null,null,null,null,null,null,null,null,null,"Y46","stage of lactation",{"$f":"IF($H$7=\"\",\"\",VLOOKUP($H$7,'Data source'!$B$251:$C$254,2,FALSE))","v":""},{"$f":"$CJ$7","v":""},null,"change LWT/d",null,{"$f":"IF(OR(H8=\"\",H9=\"\"),\"\",ABS($H$8*0.0658*$H$9)/30)","v":""},{"$f":"$CO$7","v":""},"AC40 & AE40","Difference in DMI (kg DM)",{"$f":"IF(OR(CS6=\"\",CS4=\"\"),\"\",$CS$6/$CS$4)","v":""},null,{"$f":"IF($CU$4=\"\",\"\",$CU$6/$CU$4)","v":{"$error":"#VALUE!"}}]
[null,null,"Average liveweight (kg)",null,null,null,null,null,null,"Terrain",null,null,null,null,null,null,null,null,null,null,null,null,"total activity",null,null,null,null,null,null,{"$f":"IF(OR($O$8=\"\",$O$9=\"\"),\"\",$CJ$13*$O$9)","v":""},null,null,null,null,null,null,null,null,null,null,null,null,null,null,null,null,null,null,null,null,null,null,null,null,null,null,null,null,null,null,null,null,null,null,null,null,null,null,null,null,null,null,null,null,null,null,null,null,null,null,null,null,null,null,null,null,"breed",{"$f":" IF($H$6=\"\",\"\",IF($H$6=\"Jersey\",\"j\",IF($H$6=\"Friesian\",\"f\",IF($H$6=\"cross-bred\",\"x\",\"-\"))))","v":""},{"$f":"$CJ$8","v":""},null,"ME loss/d",null,{"$f":" IF($H$7=\"\",\"\",IF($H$7=\"dry\",$CO$7*-30,$CO$7*-37))","v":""},{"$f":"$CO$8","v":""},"AE11, AF11","ME required adjustment for avg feed ME ",{"$f":"IF(AND(CS4>7.5,CS4<8.5),1.15,IF(AND(CS4>8.5,CS4<9.5),1.1,IF(AND(CS4>=9.5,CS4<10.5),1.05,IF(AND(CS4>=10.5,CS4<11.5),1,IF(AND(CS4>=11.5,CS4<12.5),0.95,IF(CS4>12.5,0.9,\"\"))))))","v":1},null,{"$f":"IF(AND(CU4>7.5,CU4<8.5),1.15,IF(AND(CU4>8.5,CU4<9.5),1.1,IF(AND(CU4>=9.5,CU4<10.5),1.05,IF(AND(CU4>=10.5,CU4<11.5),1,IF(AND(CU4>=11.5,CU4<12.5),0.95,IF(CU4>12.5,0.9,\"\"))))))","v":1}]
[null,null,"Estimated  BCS loss/gain next month",null,null,null,null,null,"i","Total daily walking dist. (km)",null,null,null,null,null,null,{"$f":"IF(O9<15,\"\",\"Check distance\")","v":""},null,null,null,null,null,"Sum of ME requirements at default ME = 11 .0",null,null,null,null,null,null,{"$f":"IF(SUM(AD4:AD8)>0,SUM(AD4:AD8),\"\")","v":""},"Opt 2",null,null,null,null,null,null,null,null,null,null,null,null,null,null,null,null,null,null,null,null,null,null,null,null,null,null,null,null,null,null,null,null,null,null,null,null,null,null,null,null,null,null,null,null,null,null,null,null,null,null,null,null,null,null,null,null,null,null,null,"ME gain/d",null,{"$f":"IF($H$7=\"\",\"\",IF($H$7=\"dry\",$CO$7*72,$CO$7*50))","v":""},{"$f":"$CO$9","v":""},"AE12 & AF 12","Total ME requirements at diet ME   = ",{"$f":"AD11","v":""},null,{"$f":"$AD$9*CU8","v":{"$error":"#VALUE!"}}]
[null,null,"Date of next calving (PSC)",null,null,null,null,null,null,"Weeks to next PSC",null,null,null,null,{"$f":"IF($H$10=\"\",\"\",IF(N3=\"\",(H10-E3)/7,(H10-N3)/7))","v":""},null,{"$f":"IF($H$10=\"\",\"Enter PSC\",\"\")","v":"Enter PSC"},null,null,null,null,null,"Multiplier for feed quality (+/- 5% per MJ ME)",null,null,null,null,null,null,{"$f":"IF($AD$9=\"\",\"\",$CS$8)","v":""},{"$f":"IF($AD$9=\"\",\"\",$CU$8)","v":""},null,null,null,null,null,null,null,null,null,null,null,null,null,null,null,null,null,null,null,null,null,null,null,null,null,null,null,null,null,null,null,null,null,null,null,null,null,null,null,null,null,null,null,null,null,null,null,null,null,null,null,null,null,null,null,"wk precalving",{"$f":"IF(O10=\"Enter PSC\",\"\",IF($O$10>12,\"12+\",$O$10))","v":"12+"},{"$f":"$CJ$10","v":"12+"}]
[null,null,null,null,null,null,null,null,null,{"$f":"IF(P10=\"Enter PSC\",\"\",IF(OR(P10>52,P10<0),\"Check PSC date for the next calving\",\"\"))","v":""},null,null,null,{"$f":"IF(Q10=\"Enter PSC\",\"\",IF(OR(O10>52,O10<0),\"Check PSC date for the next calving\",\"\"))","v":""},null,null,null,null,null,null,null,null,"Total ME requirements at diet ME   = ",null,null,null,"OPT.1",{"$f":"CS4","v":11},null,{"$f":"IF($AD$9=\"\",\"\",$AD$9*$AD$10)","v":""},{"$f":"IF($AD$9=\"\",\"\",$AD$9*$AE$10)","v":""},null,null,null,null,null,null,null,null,null,null,null,null,null,null,null,null,null,null,null,null,null,null,null,null,null,null,null,null,null,null,null,null,null,null,null,null,null,null,null,null,null,null,null,null,null,null,null,null,null,null,null,null,null,null,"AD6","milk production",{"$f":"IF($H$6=\"\",\"\",VLOOKUP($H$6,'Data source'!$B$203:$C$205,2,FALSE))","v":""},{"$f":"$CJ$11","v":""},"pregnancy",{"$f":"IF(CJ14=\"12\",CM12,IF(CJ14=\"8\",CM13,IF(CJ14=\"4\",CM14,IF(CJ14=\"2\",CM15,0))))","v":0}]
[null,null,null,null,null,null,null,null,null,null,null,null,null,null,null,null,null,null,null,null,null,null,"All MOB  inputs complete?",null,{"$f":"IF(OR(AD4=\"\",AD5=\"\",AD6=\"\",AD7=\"\",AD8=\"\",AD9=\"\"),\"NO\",\"YES\")","v":"NO"},null,"OPT.2",{"$f":"CU4","v":11},{"$f":"IF(AD11=\"\",\"i\",\"\")","v":"i"},null,null,null,null,null,null,null,null,null,null,null,null,null,null,null,null,null,null,null,null,null,null,null,null,null,null,null,null,null,null,null,null,null,null,null,null,null,null,null,null,null,null,null,null,null,null,null,null,null,null,null,null,null,null,null,null,null,"pregnancy",{"$f":"$CM$11","v":0},{"$f":"$CJ$12","v":0},12,{"$f":"VLOOKUP($H$8,'Data source'!$B$190:$H$199,4,FALSE)","v":{"$error":"#N/A"}}]
[null,"2. PASTURE QUALITY & ALLOCATION",null,null,null,null,null,null,null,"PASTURE ALLOCATION (for Option 1)",null,null,null,null,null,null,null,null,null,null,null,null,null,null,null,null,null,null,null,null,null,null,null,null,null,null,null,null,null,null,null,null,null,null,null,null,null,null,null,null,null,null,null,null,null,null,null,null,null,null,null,null,null,null,null,null,null,null,null,null,null,null,null,null,null,null,null,null,null,null,null,null,null,null,null,null,"per kg walked",{"$f":"IF($O$8=\"\",\"\",VLOOKUP($O$8,'Data source'!$B$209:$C$211,2,FALSE))","v":""},{"$f":"$CJ$13","v":""},8,{"$f":"VLOOKUP($H$8,'Data source'!$B$190:$H$199,5,FALSE)","v":{"$error":"#N/A"}},null,null,null,null,"Not needed now - replaces with a VLOOKUP at H29"]
[null,null,"PASTURE QUALITY",null,null,null,null,null,null,"Pre-grazing cover",null,null,null,null,null,null,"kg DM/ha",null,null,null,null,null,"TRANSITION COW",null,null,null,null,null,null,null,null,{"$f":"IF(H7=\"Dry\",\"YES\",\"NO\")","v":"NO"},null,null,null,null,null,null,null,null,null,null,null,null,null,null,null,null,null,null,null,null,null,null,null,null,null,null,null,null,null,null,null,null,null,null,null,null,null,null,null,null,null,null,null,null,null,null,null,null,null,null,null,null,null,null,"wk pre PSC blocks",{"$f":"IF(O10=\"Enter PSC\",\"\",IF(O10>12,\"12+\",IF(O10>8,\"12\",IF(O10>4,\"8\",IF(O10>2,\"4\",\"2\")))))","v":"12+"},{"$f":"$CJ$14","v":"12+"},4,{"$f":"VLOOKUP($H$8,'Data source'!$B$190:$H$199,6,FALSE)","v":{"$error":"#N/A"}},null,null,null,null,"fodder beet DM calc"]
[null,null,"Pasture quality",null,null,null,null,null,null,"Post-grazing residual ",null,null,null,null,null,null,"kg DM/ha",null,null,null,null,null,"Transition cow (2-3 weeks pre-calving)",null,null,null,null,null,null,"NO",null,{"$f":"IF(AND($H$7=\"Dry\",$AD$15=\"YES\"),\"YES\",\"NO\")","v":"NO"},null,null,null,null,null,null,null,null,null,null,null,null,null,null,null,null,null,null,null,null,null,null,null,null,null,null,null,null,null,null,null,null,null,null,null,null,null,null,null,null,null,null,null,null,null,null,null,null,null,null,null,null,null,null,null,null,null,2,{"$f":"VLOOKUP($H$8,'Data source'!$B$190:$H$199,7,FALSE)","v":{"$error":"#N/A"}},null,null,null,null,"Bulb only",{"$f":"$Q$29","v":""}]
[null,null,"MJME",null,null,null,null,{"$f":"IF(E15=\"\",\"\",VLOOKUP(E15,'Data source'!$B$4:$I$12,3,FALSE))","v":""},null,"Hectares grazed/day  -this mob",null,null,null,null,null,null,"ha/day",null,null,null,null,null,"Are cows at or above target BCS for calving?",null,null,null,null,null,null,"YES",null,{"$f":"IF(AND($H$7=\"Dry\",$AD$15=\"YES\",$AD$16=\"YES\"),\"YES\",\"NO\")","v":"NO"},null,null,null,null,null,null,null,null,null,null,null,null,null,null,null,null,null,null,null,null,null,null,null,null,null,null,null,null,null,null,null,null,null,null,null,null,null,null,null,null,null,null,null,null,null,null,null,null,null,null,null,null,null,null,null,null,null,null,null,null,null,null,null,"bulb 90% leaf 10%",{"$f":"$Q$29*0.9+$Q$30*0.1","v":{"$error":"#VALUE!"}}]
[null,null,null,null,null," adjust MJME? ",null,null,{"$f":"IF(H17>0,H17,H16)","v":""},"Allocation per day ",null,null,null,null,{"$f":"IF(OR(O14=\"\",O15=\"\",O16=\"\",O6=\"\"),\"\",((O14-O15)*O16)/O6)","v":""},null,"kg DM/cow",null,null,null,null,null,{"$f":"IF(AD16=\"NO\",\"Use FeedChecker values below\",IF(AF16=\"YES\",\"Feed cows at 90% of energy requirements\",\"\"))","v":""},null,null,null,null,null,null,null,null,{"$f":"IF(AND($H$7=\"Dry\",$AD$15=\"YES\",$AD$16=\"NO\"),\"NO\",\"\")","v":""},null,null,null,null,null,null,null,null,null,null,null,null,null,null,null,null,null,null,null,null,null,null,null,null,null,null,null,null,null,null,null,null,null,null,null,null,null,null,null,null,null,null,null,null,null,null,null,null,null,null,null,null,null,null,null,null,null,null,null,null,null,null,null,"bulb 85% leaf 15%",{"$f":"$Q$29*0.85+$Q$30*0.15","v":{"$error":"#VALUE!"}}]
[null,null,"ROUND LENGTH ESTIMATE",null,null,null,"ha grazed/day",null,null,null,null,null,null,null,"OR",null,null,null,null,null,null,null,null,null,null,null,null,null,null,null,null,null,null,null,null,null,null,null,null,null,null,null,null,null,null,null,null,null,null,null,null,null,null,null,null,null,null,null,null,null,null,null,null,null,null,null,null,null,null,null,null,null,null,null,null,null,null,null,null,null,null,null,null,null,null,null,null,null,null,null,null,null,null,null,null,"bulb 80% leaf 20%",{"$f":"$Q$29*0.8+$Q$30*0.2","v":{"$error":"#VALUE!"}}]
[null,null,"Farm area in current round (ha)",null,null,null,{"$f":"$O$16","v":0},"This mob",null,null,null,null,null,null,null,null,null,null,null,null,null,null,"RECOMMENDED",null,null,null,"OPTION 1",null,"OPTION 2",null,null,null,null,null,null,null,null,null,null,null,null,null,null,null,null,null,null,null,null,null,null,null,null,null,null,null,null,null,null,null,null,null,null,null,null,null,null,null,null,null,null,null,null,null,null,null,null,null,null,null,null,null,null,null,null,null,null,{"$f":"H32*0.9+H33*0.1","v":0},null,null,null,null,null,null,null,"bulb 75% leaf 25%",{"$f":"$Q$29*0.75+$Q$30*0.25","v":{"$error":"#VALUE!"}}]
[null,null,"Total area  grazed  (ha/day)",null,{"$f":"G19+G20+G21+G22","v":0},"all mobs",null,"Mob 2",null,"Directly input pasture?",null,null,null,null,null,null,"kg DM/cow",null,null,null,null,null,"Eaten","Opt 1","Opt 2",null,null,"diff",null,"diff",null,{"$f":"IF(O20=\"\",1,0)","v":1},null,null,null,null,null,null,null,null,null,null,null,null,null,null,null,null,null,null,null,null,null,null,null,null,null,null,null,null,null,null,null,null,null,null,null,null,null,null,null,null,null,null,null,null,null,null,null,null,null,null,null,null,null,null,null,{"$f":"H33*0.9+H34*0.1","v":0},null,null,null,null,null,null,null,"bulb 70% leaf 30%",{"$f":"$Q$29*0.7+$Q$30*0.3","v":{"$error":"#VALUE!"}}]
[null,null,null,null,null,null,null,"Mob 3",null,null,null,null,null,null,null,null,null,null,null,null,null,null,"DM (90%)",{"$f":"X41*0.9","v":{"$error":"#VALUE!"}},{"$f":"Y41*0.9","v":{"$error":"#VALUE!"}},null,{"$f":"$AA$41","v":""},{"$f":"AA21-X21","v":{"$error":"#VALUE!"}},{"$f":"AC41","v":""},{"$f":"IF($O$72>0,AC21-Y21,\"\")","v":{"$error":"#VALUE!"}},null,null,null,null,null,null,null,null,null,null,null,null,null,null,null,null,null,null,null,null,null,null,null,null,null,null,null,null,null,null,null,null,null,null,null,null,null,null,null,null,null,null,null,null,null,null,null,null,null,null,null,null,null,null,null,null,null,{"$f":"H34*0.9+H35*0.1","v":0}]
[null,null,"Round length (days)",null,{"$f":"IF(AND($E19>0,$E$20>0),$E$19/$E$20,\"\")","v":""},null,null,"Mob 4",null,null,null,null,null,null,null,null,null,null,null,null,null,null,"Average MJME/kg DM",null,null,null,{"$f":"IF(OR($Y$12=\"NO\",$AF$16=\"NO\",$CS$4=\"\"),\"\",$CS$4)","v":""},null,{"$f":"IF(OR($Y$12=\"NO\",$AF$16=\"NO\",$Q$35=\"NO\",$CS$4=\"\"),\"\",$CU$4)","v":""},null,null,{"$f":"IF(OR(E27=\"\",E28=\"\",E29=\"\",E30=\"\"),\"X\",\"+\")","v":"X"},null,null,null,null,null,null,null,null,null,null,null,null,null,null,null,null,null,null,null,null,null,null,null,null,null,null,null,null,null,null,null,null,null,null,null,null,null,null,null,null,null,null,null,null,null,null,null,null,null,null,null,null,null,null,null,{"$f":"H35*0.9+H36*0.1","v":0}]
[null,null,null,null,null,null,null,null,null,null,null,null,null,null,null,null,null,null,null,null,null,null,"MJME (90%)",{"$f":"X44*0.9","v":{"$error":"#VALUE!"}},{"$f":"Y44+0.9","v":{"$error":"#VALUE!"}},null,{"$f":"$AA$44","v":""},{"$f":"AA23-X23","v":{"$error":"#VALUE!"}},{"$f":"$AC$44","v":""},{"$f":"IF($O$72>0,$AC$23-$Y$23,\"\")","v":{"$error":"#VALUE!"}},null,{"$f":"IF(OR(E27=\"\",E29=\"\",E30=\"\"),\"X\",\"3/4\")","v":"X"}]
[null,null,null,null,null,null,null,null,null,null,null,null,null,null,null,null,null,null,null,null,null,null,null,null,null,null,null,null,null,null,null,{"$f":"E27/10","v":0},null,null,null,null,null,null,null,null,null,null,null,null,null,null,null,null,null,null,null,null,null,null,null,null,null,null,null,null,null,null,null,null,null,null,null,null,null,null,null,null,null,null,null,null,null,null,null,null,null,null,null,null,null,null,"Dropdown list"]
[null,"3. ARE YOU FEEDING CROPS?",null,null,null,null,null,null,"YES",null,null,null,"Are you feeding Fodder beet?",null,null,null,"NO",null,null,null,null,null,null,null,null,null,null,null,null,null,null,{"$f":"(AF24*E28)/100","v":0},null,null,null,null,null,null,null,null,null,null,null,null,null,null,null,null,null,null,null,null,null,null,null,null,null,null,null,null,null,null,null,null,null,null,null,null,null,null,null,null,null,null,null,null,null,null,null,null,null,null,null,null,null,null,"YES"]
[null,null,"CALCULATE BREAK SIZE",null,null,null,null,null,null,null,null,null,null,null,null,null,null,null,null,null,null,null,null,null,null,null,null,null,null,null,null,{"$f":"(AF24*Q31)/100","v":{"$error":"#VALUE!"}},null,null,null,null,null,null,null,null,null,null,null,null,null,null,null,null,null,null,null,null,null,null,null,null,null,null,null,null,null,null,null,null,null,null,null,null,null,null,null,null,null,null,null,null,null,null,null,null,null,null,null,null,null,null,"NO"]
[null,null,"Crop yield (T/ha)",null,null,null,null,null,null,"CALC DM% of FODDER BEET CROP",null,null,null,null,null,null,null,null,null,null,null,null,null,null,null,null,null,null,null,null,null,{"$f":"AF29/E29","v":{"$error":"#DIV/0!"}},null,null,null,null,null,null,null,null,null,null,null,null,null,null,null,null,null,null,null,null,null,null,null,null,null,null,null,null,null,null,null,null,null,null,null,null,null,null,null,null,null,null,null,null,null,null,null,null,null,null,null,null,null,null,null,{"$f":"IF($H$7=\"\",\"\",VLOOKUP($H$7,'Data source'!$B$261:$C$264,2,FALSE))","v":""}]
[null,null,"DM (%)",null,null,"Leave blank to use fodder beet %DM calc",null,null,null,"Bulb to leaf ratio",null,null,"Custom: Bulb% & Leaf%",null,null,null,null,null,null,null,null,null,null,null,"   ",null,null,null,null,null,null,{"$f":"AF30/E29","v":{"$error":"#VALUE!"}}]
[null,null,"Break face (metres)",null,null,{"$f":"IF(AND($I$25=\"YES\",$Q$25=\"YES\",$E$29<O6),\"check break size\",\"\")","v":""},null,null,null,"Bulb DM%",null,null,null,null,null,null,{"$f":"IF(AND(I25=\"NO\",Q25=\"NO\"),\"\",IF(Q25=\"YES\",'CUSTOM FEED SET-UP'!E5,\"\"))","v":""},null,null,null,null,null,null,null,"  ",null,null,null,null,null,null,{"$f":"E30/AF25","v":{"$error":"#DIV/0!"}}]
[null,null,"Allocation  (kg DM/cow/day)",null,null,null,null,null,null,"Leaf DM%",null,null,null,null,null,null,{"$f":"IF(AND(I25=\"NO\",Q25=\"NO\"),\"\",IF(Q25=\"YES\",'CUSTOM FEED SET-UP'!E6,\"\"))","v":""},null,null,null,null,null,null,null,null,null,null,null,null,null,null,{"$f":"E30/AF26","v":{"$error":"#VALUE!"}}]
[null,null,"Break size (metres/day)",null,{"$f":"IF(AF22=\"+\",AF31,IF(AND(Q25=\"YES\",AF23=\"3/4\"),AF32,\"\"))","v":""},{"$f":"IF(E31=\"\",\"\",IF(AND(E28=\"\",E31=AF32),\"Using fodder beet DM% calc\",\"Using direct input DM%\"))","v":""},null,null,null,"CropDM%",null,null,null,null,null,null,{"$f":"IF(OR(Q25=\"NO\",M28=\"\"),\"\",VLOOKUP(M28,'CUSTOM FEED SET-UP'!B5:E12,4,FALSE))","v":""},null,null,null,null,null,null,null,null,null,null,null,null,null,null,{"$f":"AF27*O6","v":{"$error":"#DIV/0!"}}]
[null,null,null,null,null,null,null,null,null,null,null,null,null,null,null,null,null,null,null,null,null,null,null,null,null,null,null,null,null,null,null,{"$f":"AF28*O6","v":{"$error":"#VALUE!"}}]
[null,null,null,null,null,null,null,null,null,null,null,null,null,null,null,null,null,null,null,null,null,null,null,null,null,null,null,null,null,null,null,null,null,null,null,"Feed Budget?",null,null,null,"NO"]
[null,null,null,null,null,null,null,null,null,null,null,null,null,null,null,null,null,null,null,null,null,"FEEDCHECKER"]
[null,null,null,null,null,null,null,null,null,null,null,null,null,null,"Option 2?",null,"NO",null,null,null,null,null,null,null,null,null,null,null,null,null,null,null,null,null,null,"5. FEED BUDGET",null,null,null,"OPTION 1",null,null,"OPTION 2",null,null,null,"6. FEED BREAKDOWN",null,"ENERGY",null,null,null,null,null,"COMPOSITION",null,null,null,null,null,null,null,null,null,null,"MINERALS",null,null,null,null,null,null,null,"DCAD",null,"COST OF SUPPLEMENT"]
[null,"4. FEED AND MINERAL SUPPLY",null,null,null,null,null,null,null,null,"OPTION 1",null,null,null,"OPTION 2"]
[null,null,null,null,null,null,null,null,null,null,"OFFERED",null,"EATEN",null,"OFFERED",null,"EATEN",null,null,null,null,null,"RECOMMENDED",null,null,null,"OPTION 1",null,"OPTION 2",null,null,null,null,null,null,null,"$/tonne delivered","c/MJME eaten",null,"t/day  /mob","$/cow /day",null,"t/day  /mob","$/cow /day",null,null,"FEED TYPE","Opt.","Util.","Eaten","ME","DM%","ME",null,"Crude protein",null,"NDF",null,"SSS",null,"Starch",null,"Fat",null,null,"Na","K","Cl","S","Mg","Ca","P",null,"meq",null,"Wt","Eaten","Eaten","Cost"]
[null,null,"FEED TYPE",null,"FEED",null,null,"FEEDING METHOD",null,"Util.","kg DM /cow",null,"kg DM /cow",null,"kg DM /cow",null,"kg DM /cow",null,null,null,null,null,null,null,null,null,null,null,null,null,null,null,null,null,null,null,null,null,null,null,null,null,null,null,null,null,null,null,null,null,null,null,"in diet",null,"% DM","% diet","% DM","% diet","% DM","% diet","% SSS","% diet","% DM","% diet",null,"%DM","%DM","%DM","%DM","%DM","%DM","%DM",null,"/100g DM",null,"Wet/Dry","c/kg DM","c/MJ ME","$/Cow"]
[]
[null,null,null,null,null,null,null,null,null,null,null,null,null,null,null,null,null,null,null,null,null,null,"DM eaten","Opt 1","Opt 2",null,null,"diff",null,"diff",null,null,null,null,null,null,{"$f":"IF(OR(AN33=\"NO\",X41=\"\"),\"\",\"i\")","v":""},null,null,null,null,null,null,null,null,null,{"$f":"IF(C41=\"\",\"\",C41)","v":"PASTURE"},{"$f":"IF(L41=\"\",\"\",1)","v":""},{"$f":"IF(OR($E41=\"\",$H41=\"\",$K41=0),0,VLOOKUP($H41,'Data source'!$B$121:$C$124,2,FALSE))","v":0},{"$f":"IF(OR($E41=\"\",$H41=\"\",$K41=0,$K41=\"\"),0,K41*AW40)","v":0},{"$f":"IF(OR($E41=\"\",$H41=\"\",$K41=0),\"\",$I$17)","v":""},{"$f":"IF(OR($E41=\"\",$H41=\"\",$K41=0),\"\",VLOOKUP($E41,'Data source'!$B$4:$I$12,2,FALSE))","v":""},{"$f":"IF(OR($E41=\"\",$H41=\"\",$K41=0),\"\",AX40*AY40)","v":""},null,{"$f":"IF(OR($E41=\"\",$H41=\"-\",$K41=0),\"\",VLOOKUP($E41,'Data source'!$B$4:$I$12,4,FALSE))","v":""},{"$f":"IF(OR($E41=\"\",$H41=\"\",$K41=0),\"\",(($AX40/$AX$72)*BC40))","v":""},{"$f":"IF(OR($E41=\"\",$H41=\"\",$K41=0),\"\",VLOOKUP($E41,'Data source'!$B$4:$I$12,5,FALSE))","v":""},{"$f":"IF(OR($E41=\"\",$H41=\"\",$K41=0),\"\",(($AX40/$AX$72)*BE40))","v":""},{"$f":"IF(OR($E41=\"\",$H41=\"\",$K41=0),\"\",VLOOKUP($E41,'Data source'!$B$4:$I$12,6,FALSE))","v":""},{"$f":"IF(OR($E41=\"\",$H41=\"\",$K41=0),\"\",(($AX40/$AX$72)*BG40))","v":""},{"$f":"IF(OR($E41=\"\",$H41=\"\",$K41=0),\"\",VLOOKUP($E41,'Data source'!$B$4:$I$12,7,FALSE))","v":""},{"$f":"IF(OR($E41=\"\",$H41=\"\",$K41=0),\"\",(BI40/100*BH40)*($AX40/$AX$72))","v":""},{"$f":"IF(OR($E41=\"\",$H41=\"\",$K41=0),\"\",VLOOKUP($E41,'Data source'!$B$4:$I$12,8,FALSE))","v":""},{"$f":"IF(OR($E41=\"\",$H41=\"\",$K41=0),\"\",(($AX40/$AX$72)*BK40))","v":""},null,{"$f":"IF(OR($E41=\"\",$H41=\"\",$K41=0),0,VLOOKUP($E41,'Data source'!$B$3:$T$14,13,FALSE))","v":0},{"$f":"IF(OR($E41=\"\",$H41=\"\",$K41=0),0,VLOOKUP($E41,'Data source'!$B$3:$T$14,14,FALSE))","v":0},{"$f":"IF(OR($E41=\"\",$H41=\"\",$K41=0),0,VLOOKUP($E41,'Data source'!$B$3:$T$14,15,FALSE))","v":0},{"$f":"IF(OR($E41=\"\",$H41=\"\",$K41=0),0,VLOOKUP($E41,'Data source'!$B$3:$T$14,16,FALSE))","v":0},{"$f":"IF(OR($E41=\"\",$H41=\"\",$K41=0),0,VLOOKUP($E41,'Data source'!$B$3:$T$14,17,FALSE))","v":0},{"$f":"IF(OR($E41=\"\",$H41=\"\",$K41=0),0,VLOOKUP($E41,'Data source'!$B$3:$T$14,18,FALSE))","v":0},{"$f":"IF(OR($E41=\"\",$H41=\"\",$K41=0),0,VLOOKUP($E41,'Data source'!$B$3:$T$14,19,FALSE))","v":0},null,{"$f":"IF(OR($E41=\"\",$H41=\"\",$K41=\"\"),0,(((43.498*$BN40)+(25.574*$BO40))-((28.206*$BP40)+(62.375*$BQ40)))*$AX40*10/1000)","v":0}]
[null,null,"PASTURE",null,{"$f":"IF(E15=\"\",\"\",E15)","v":""},null,null,null,null,{"$f":"AW40","v":0},{"$f":"IF(O20=\"\",O17,O20)","v":""},{"$f":"IF(OR(C41=\"\",E41=\"\",H41=\"\"),\"\",K41)","v":""},{"$f":"IF(AX40=0,\"\",AX40)","v":""},null,null,{"$f":"IF(OR(C41=\"\",E41=\"\",H41=\"\"),\"\",O41)","v":""},{"$f":"IF(AX41=0,\"\",AX41)","v":""},null,null,null,null,null,"DM",{"$f":"IF(Y12=\"NO\",\"\",CS5)","v":""},{"$f":"IF(Y12=\"NO\",\"\",CU5)","v":""},null,{"$f":"IF($AX$72>0,AX72,\"\")","v":""},{"$f":"IF(AND($AX$72>0,Y12=\"Yes\"),IF(AA41=\"\",\"\",$AA$41-$X$41),\"\")","v":""},{"$f":"IF(AND($Q$35=\"YES\",$O$72>0),$AX$73,\"\")","v":""},{"$f":"IF(AND(Q35=\"YES\",O73>0,Y12=\"Yes\",AC41>0),$AC$41-$Y$41,\"\")","v":""},null,null,null,null,null,null,null,null,null,null,null,null,null,null,null,null,null,{"$f":"IF(OR(P41=\"\",$Q$35=\"NO\"),\"\",2)","v":""},{"$f":"IF(OR($E41=\"\",$H41=\"\",$O41<=0,$Q$35=\"NO\"),\"\",VLOOKUP($H41,'Data source'!$B$121:$C$124,2,FALSE))","v":""},{"$f":"IF(OR($E41=\"\",$H41=\"\",$O41<=0,$Q$35=\"NO\"),0,$O41*$AW41)","v":0},{"$f":"IF(OR($E41=\"\",$H41=\"\",$O41<=0,$Q$35=\"NO\"),\"\",$I$17)","v":""},{"$f":"IF(OR($E41=\"\",$H41=\"\",$O41<=0,$Q$35=\"NO\"),\"\",VLOOKUP($E$41,'Data source'!$B$4:$I$12,2,FALSE))","v":""},{"$f":"IF(OR($E41=\"\",$H41=\"\",$O41<=0,$Q$35=\"NO\"),\"\",$AX41*$AY41)","v":""},null,{"$f":"IF(OR($E41=\"\",$H41=\"\",$O41<=0,$Q$35=\"NO\"),\"\",VLOOKUP($E$41,'Data source'!$B$4:$I$12,4,FALSE))","v":""},{"$f":"IF(OR($E41=\"\",$H41=\"\",$O41<=0,$Q$35=\"NO\"),\"\",(($AX41/$AX$73)*$BC41))","v":""},{"$f":"IF(OR($E41=\"\",$H41=\"\",$O41<=0,$Q$35=\"NO\"),\"\",VLOOKUP($E$41,'Data source'!$B$4:$I$12,5,FALSE))","v":""},{"$f":"IF(OR($E41=\"\",$H41=\"\",$O41<=0,$Q$35=\"NO\"),\"\",(($AX41/$AX$73)*BE41))","v":""},{"$f":"IF(OR($E41=\"\",$H41=\"\",$O41<=0,$Q$35=\"NO\"),\"\",VLOOKUP($E$41,'Data source'!$B$4:$I$12,6,FALSE))","v":""},{"$f":"IF(OR($E41=\"\",$H41=\"\",$O41<=0,$Q$35=\"NO\"),\"\",(($AX41/$AX$73)*BG41))","v":""},{"$f":"IF(OR($E41=\"\",$H41=\"\",$O41<=0,$Q$35=\"NO\"),\"\",VLOOKUP($E$41,'Data source'!$B$4:$I$12,7,FALSE))","v":""},{"$f":"IF(OR($E41=\"\",$H41=\"\",$O41<=0,$Q$35=\"NO\"),\"\",(BI41/100*BH41)*($AX41/$AX$73))","v":""},{"$f":"IF(OR($E41=\"\",$H41=\"\",$O41<=0,$Q$35=\"NO\"),\"\",VLOOKUP($E$41,'Data source'!$B$4:$I$12,8,FALSE))","v":""},{"$f":"IF(OR($E41=\"\",$H41=\"\",$O41<=0,$Q$35=\"NO\"),\"\",(($AX41/$AX$73)*BK41))","v":""},null,{"$f":"IF(OR($E41=\"\",$H41=\"\",$O41<=0,$Q$35=\"NO\"),0,VLOOKUP($E41,'Data source'!$B$3:$T$14,13,FALSE))","v":0},{"$f":"IF(OR($E41=\"\",$H41=\"\",$O41<=0,$Q$35=\"NO\"),0,VLOOKUP($E41,'Data source'!$B$3:$T$14,14,FALSE))","v":0},{"$f":"IF(OR($E41=\"\",$H41=\"\",$O41<=0,$Q$35=\"NO\"),0,VLOOKUP($E41,'Data source'!$B$3:$T$14,15,FALSE))","v":0},{"$f":"IF(OR($E41=\"\",$H41=\"\",$O41<=0,$Q$35=\"NO\"),0,VLOOKUP($E41,'Data source'!$B$3:$T$14,16,FALSE))","v":0},{"$f":"IF(OR($E41=\"\",$H41=\"\",$O41<=0,$Q$35=\"NO\"),0,VLOOKUP($E41,'Data source'!$B$3:$T$14,17,FALSE))","v":0},{"$f":"IF(OR($E41=\"\",$H41=\"\",$O41<=0,$Q$35=\"NO\"),0,VLOOKUP($E41,'Data source'!$B$3:$T$14,18,FALSE))","v":0},{"$f":"IF(OR($E41=\"\",$H41=\"\",$O41<=0,$Q$35=\"NO\"),0,VLOOKUP($E41,'Data source'!$B$3:$T$14,19,FALSE))","v":0},null,{"$f":"IF(OR($E41=\"\",$H41=\"\",$O41<=0,$Q$35=\"NO\"),0,((43.498*$BN41)+(25.574*$BO41))-((28.206*$BP41)+(62.375*$BQ41)))*$AX41*10/1000","v":0}]
[null,null,null,null,null,null,null,null,null,null,null,null,null,null,null,null,null,null,null,null,null,null,null,null,null,null,null,null,null,null,null,null,null,null,null,null,null,null,null,null,null,null,null,null,null,null,null,null,null,null,3,2,null,null,4,null,5,null,6,null,7,null,8,null,null,13,14,15,16,17,18,19]
[null,null,null,null,null,null,null,null,null,null,null,null,null,null,null,null,null,null,null,null,null,null,"Average MJME/kg DM",null,null,null,{"$f":"IF(OR($Y$12=\"NO\",$CS$4=\"\"),\"\",$CS$4)","v":""},null,{"$f":"IF(OR($Q$35=\"NO\",$Y$12=\"NO\",$CU$4=\"\"),\"\",$CU$4)","v":""},null,null,{"$f":"IF($C44=\"Hay_Silage\",\"FT1_\",IF($C44=\"Concentrates\",\"FT2_\",IF($C44=\"By_products\",\"FT3_\",IF($C44=\"Fodder_beet_Default\",\"FT4_\",IF($C44=\"Other_Crops_Default\",\"FT5_\",IF($C44=\"Minerals\",\"FT6_\",IF($C44=\"Custom_Feeds_Minerals\",\"FT7_\",IF($C44=\"Custom_Bulb_Crops\",\"FT8_\",\"-\"))))))))","v":"-"},null,null,null,null,400,{"$f":"IF(OR($E44=\"\",$H44=\"\"),\"\",IF(AY43=\"\",IF(AY44>0,BZ44,0),BZ43))","v":""},null,{"$f":"IF(OR($E44=\"\",$H44=\"\",$K44=\"\",$O$6=\"\"),\"\",($K44/1000)*$O$6)","v":""},{"$f":"CA43","v":""},null,{"$f":"IF(OR($E44=\"\",$H44=\"\",$O44=\"\",$O$6=\"\"),\"\",($O44/1000)*$O$6)","v":""},{"$f":"CA44","v":""},null,null,{"$f":"IF(E44=\"\",\"\",E44)","v":""},{"$f":"IF(L44=\"\",\"\",1)","v":""},{"$f":"IF(OR($E44=\"\",$H44=\"\",$K44<=0),\"\",VLOOKUP($H44,'Data source'!$B$128:$C$188,2,FALSE))","v":""},{"$f":"IF(OR($E44=\"\",$H44=\"\",$K44<=0),0,K44*AW43)","v":0},{"$f":"IF(OR($E44=\"\",$H44=\"-\",$K44=0),\"\",VLOOKUP($E44,'Data source'!$B$4:$I$111,3,FALSE))","v":""},{"$f":"IF(OR($E44=\"\",$H44=\"-\",$K44=0),\"\",VLOOKUP($E44,'Data source'!$B$4:$I$111,2,FALSE))","v":""},{"$f":"IF(OR($E44=\"\",$H44=\"\",$K44<=0),\"\",AX43*AY43)","v":""},null,{"$f":"IF(OR($E44=\"\",$H44=\"-\",$K44=0),\"\",VLOOKUP($E44,'Data source'!$B$4:$I$111,4,FALSE))","v":""},{"$f":"IF(OR($E44=\"\",$H44=\"\",$K44<=0),\"\",(($AX43/$AX$72)*BC43))","v":""},{"$f":"IF(OR($E44=\"\",$H44=\"-\",$K44=0),\"\",VLOOKUP($E44,'Data source'!$B$4:$I$111,5,FALSE))","v":""},{"$f":"IF(OR($E44=\"\",$H44=\"\",$K44<=0),\"\",(($AX43/$AX$72)*BE43))","v":""},{"$f":"IF(OR($E44=\"\",$H44=\"-\",$K44=0),\"\",VLOOKUP($E44,'Data source'!$B$4:$I$111,6,FALSE))","v":""},{"$f":"IF(OR($E44=\"\",$H44=\"\",$K44<=0),\"\",(($AX43/$AX$72)*BG43))","v":""},{"$f":"IF(OR($E44=\"\",$H44=\"-\",$K44=0),\"\",VLOOKUP($E44,'Data source'!$B$4:$I$111,7,FALSE))","v":""},{"$f":"IF(OR($E44=\"\",$H44=\"\",$K44<=0),\"\",(BI43/100*BH43)*($AX43/$AX$72))","v":""},{"$f":"IF(OR($E44=\"\",$H44=\"-\",$K44=0),\"\",VLOOKUP($E44,'Data source'!$B$4:$I$111,8,FALSE))","v":""},{"$f":"IF(OR($E44=\"\",$H44=\"\",$K44<=0),\"\",(($AX43/$AX$72)*BK43))","v":""},null,{"$f":"IF(OR($E44=\"\",$H44=\"\",$K44=0),0,VLOOKUP($E44,'Data source'!$B$4:$T$111,13,FALSE))","v":0},{"$f":"IF(OR($E44=\"\",$H44=\"\",$K44=0),0,VLOOKUP($E44,'Data source'!$B$4:$T$111,14,FALSE))","v":0},{"$f":"IF(OR($E44=\"\",$H44=\"\",$K44=0),0,VLOOKUP($E44,'Data source'!$B$4:$T$111,15,FALSE))","v":0},{"$f":"IF(OR($E44=\"\",$H44=\"\",$K44=0),0,VLOOKUP($E44,'Data source'!$B$4:$T$111,16,FALSE))","v":0},{"$f":"IF(OR($E44=\"\",$H44=\"\",$K44=0),0,VLOOKUP($E44,'Data source'!$B$4:$T$111,17,FALSE))","v":0},{"$f":"IF(OR($E44=\"\",$H44=\"\",$K44=0),0,VLOOKUP($E44,'Data source'!$B$4:$T$111,18,FALSE))","v":0},{"$f":"IF(OR($E44=\"\",$H44=\"\",$K44=0),0,VLOOKUP($E44,'Data source'!$B$4:$T$111,19,FALSE))","v":0},null,{"$f":"IF(OR($E44=\"\",$H44=\"\",$K44<=0),0,((43.498*$BN43)+(25.574*$BO43))-((28.206*$BP43)+(62.375*$BQ43)))*$AX43*10/1000","v":0},null,{"$f":"IF(OR($E44=\"\",$H44=\"\",$K44<=0,$AK43<=0),\"\",VLOOKUP($E44,'Data source'!$B$15:$M$111,12,FALSE))","v":""},{"$f":"IF(OR($E44=\"\",$H44=\"\",$K44<=0,$AK43<=0),\"\",IF($BX43=\"Dry\",$AK43/$AW43/10,IF($BX43=\"Wet\",$AK43/($AZ43/100)*$AW43/10,0)))","v":""},{"$f":"IF(OR($E44=\"\",$H44=\"\",$K44<=0,$AK43<=0,AY43=0),\"\",BY43/AY43)","v":""},{"$f":"IF(OR($E44=\"\",$H44=\"\",$K44<=0,$AK43<=0),\"\",($BY43*$K44)/100)","v":""}]
[null,null,null,{"$f":"IF(C44=\"Minerals\",\"i\",\"\")","v":""},null,null,null,null,null,{"$f":"IF(OR($C44=\"\",$E44=\"\",$H44=\"\"),\"\",VLOOKUP($H44,'Data source'!$B$128:$C$188,2,FALSE))","v":""},null,{"$f":"IF(OR(C44=\"\",E44=\"\",H44=\"\"),\"\",K44)","v":""},{"$f":"IF(AX43=0,\"\",AX43)","v":""},{"$f":"IF(OR(C44=\"\",E44=\"\",H44=\"\"),\"\",AN43)","v":""},null,{"$f":"IF(OR(C44=\"\",E44=\"\",H44=\"\"),\"\",O44)","v":""},{"$f":"IF(AX44=0,\"\",AX44)","v":""},{"$f":"IF(OR(N45=\">3\",R45=\">3\"),\"i\",\"\")","v":""},null,null,null,null,"MJME",{"$f":"IF(Y12=\"No\",\"\",AD11)","v":""},{"$f":"IF(Y12=\"No\",\"\",AE11)","v":""},null,{"$f":"IF($AX$72>0,BA72,\"\")","v":""},{"$f":"IF(AND($K$72>0,Y12=\"Yes\"),$AA$44-$X$44,\"\")","v":""},{"$f":"IF(AND($Q$35=\"YES\",$O$72>0),$BA$73,\"\")","v":""},{"$f":"IF(AND(Q35=\"YES\",O72>0,Y12=\"Yes\",AC44>0),$AC$44-$Y$44,\"\")","v":""},null,null,null,null,null,null,null,null,null,null,null,null,null,null,null,null,null,{"$f":"IF(OR(P44=\"\",$Q$35=\"NO\"),\"\",2)","v":""},{"$f":"IF(OR($E44=\"\",$H44=\"\",$O44<=0,$Q$35=\"NO\"),\"\",VLOOKUP($H44,'Data source'!$B$128:$C$188,2,FALSE))","v":""},{"$f":"IF(OR($E44=\"\",$H44=\"\",$O44<=0,$Q$35=\"NO\"),0,$O44*$AW44)","v":0},{"$f":"IF(OR($E44=\"\",$H44=\"\",$O44<=0,$Q$35=\"NO\"),\"\",VLOOKUP($E44,'Data source'!$B$4:$I$111,3,FALSE))","v":""},{"$f":"IF(OR($E44=\"\",$H44=\"\",$O44<=0,$Q$35=\"NO\"),\"\",VLOOKUP($E44,'Data source'!$B$4:$I$111,2,FALSE))","v":""},{"$f":"IF(OR($E44=\"\",$H44=\"\",$O44<=0,$Q$35=\"NO\"),\"\",$AX44*$AY44)","v":""},null,{"$f":"IF(OR($E44=\"\",$H44=\"\",$O44<=0,$Q$35=\"NO\"),\"\",VLOOKUP($E44,'Data source'!$B$4:$I$111,4,FALSE))","v":""},{"$f":"IF(OR($E44=\"\",$H44=\"\",$O44<=0,$Q$35=\"NO\"),\"\",(($AX44/$AX$73)*$BC44))","v":""},{"$f":"IF(OR($E44=\"\",$H44=\"\",$O44<=0,$Q$35=\"NO\"),\"\",VLOOKUP($E44,'Data source'!$B$4:$I$111,5,FALSE))","v":""},{"$f":"IF(OR($E44=\"\",$H44=\"\",$O44<=0,$Q$35=\"NO\"),\"\",(($AX44/$AX$73)*BE44))","v":""},{"$f":"IF(OR($E44=\"\",$H44=\"\",$O44<=0,$Q$35=\"NO\"),\"\",VLOOKUP($E44,'Data source'!$B$4:$I$111,6,FALSE))","v":""},{"$f":"IF(OR($E44=\"\",$H44=\"\",$O44<=0,$Q$35=\"NO\"),\"\",(($AX44/$AX$73)*BG44))","v":""},{"$f":"IF(OR($E44=\"\",$H44=\"\",$O44<=0,$Q$35=\"NO\"),\"\",VLOOKUP($E44,'Data source'!$B$4:$I$111,7,FALSE))","v":""},{"$f":"IF(OR($E44=\"\",$H44=\"\",$O44<=0,$Q$35=\"NO\"),\"\",(BI44/100*BH44)*($AX44/$AX$73))","v":""},{"$f":"IF(OR($E44=\"\",$H44=\"\",$O44<=0,$Q$35=\"NO\"),\"\",VLOOKUP($E44,'Data source'!$B$4:$I$111,8,FALSE))","v":""},{"$f":"IF(OR($E44=\"\",$H44=\"\",$O44<=0,$Q$35=\"NO\"),\"\",(($AX44/$AX$73)*BK44))","v":""},null,{"$f":"IF(OR($E44=\"\",$H44=\"\",$O44<=0,$Q$35=\"NO\"),0,VLOOKUP($E44,'Data source'!$B$4:$T$111,13,FALSE))","v":0},{"$f":"IF(OR($E44=\"\",$H44=\"\",$O44<=0,$Q$35=\"NO\"),0,VLOOKUP($E44,'Data source'!$B$4:$T$111,14,FALSE))","v":0},{"$f":"IF(OR($E44=\"\",$H44=\"\",$O44<=0,$Q$35=\"NO\"),0,VLOOKUP($E44,'Data source'!$B$4:$T$111,15,FALSE))","v":0},{"$f":"IF(OR($E44=\"\",$H44=\"\",$O44<=0,$Q$35=\"NO\"),0,VLOOKUP($E44,'Data source'!$B$4:$T$111,16,FALSE))","v":0},{"$f":"IF(OR($E44=\"\",$H44=\"\",$O44<=0,$Q$35=\"NO\"),0,VLOOKUP($E44,'Data source'!$B$4:$T$111,17,FALSE))","v":0},{"$f":"IF(OR($E44=\"\",$H44=\"\",$O44<=0,$Q$35=\"NO\"),0,VLOOKUP($E44,'Data source'!$B$4:$T$111,18,FALSE))","v":0},{"$f":"IF(OR($E44=\"\",$H44=\"\",$O44<=0,$Q$35=\"NO\"),0,VLOOKUP($E44,'Data source'!$B$4:$T$111,19,FALSE))","v":0},null,{"$f":"IF(OR($E44=\"\",$H44=\"\",$O44<=0,$Q$35=\"NO\"),0,((43.498*$BN44)+(25.574*$BO44))-((28.206*$BP44)+(62.375*$BQ44)))*$AX44*10/1000","v":0},null,{"$f":"IF(OR($E44=\"\",$H44=\"\",$O44<=0,$AK43<=0,$Q$35=\"NO\"),\"\",VLOOKUP($E44,'Data source'!$B$15:$M$104,12,FALSE))","v":""},{"$f":"IF(OR($E44=\"\",$H44=\"\",$O44<=0,$AK43<=0,$Q$35=\"NO\"),\"\",IF($BX44=\"Dry\",$AK43/$AW44/10,IF($BX44=\"Wet\",$AK43/($AZ44/100)*$AW44/10,0)))","v":""},{"$f":"IF(OR($E44=\"\",$H44=\"\",$O44<=0,$AK43<=0,AY44=0,$Q$35=\"NO\"),\"\",IF(OR($Q16=\"-\",$AS44=\"-\",$O44=0),\"\",BY44/AY44))","v":""},{"$f":"IF(OR($E44=\"\",$H44=\"\",$O44<=0,$AK43<=0,$Q$35=\"NO\"),\"\",IF(OR($Q16=\"-\",$AS44=\"-\",$O44=0),\"\",($BY44*$O44)/100))","v":""}]
[null,null,null,null,null,null,null,null,null,null,null,null,null,{"$f":"IF(OR($H$7=\"Dry\", K44=\"\"),\"\",IF(AND(E44=\"PKE\",K44>3),\">3\",\"\"))","v":""},null,null,null,{"$f":"IF(OR($H$7=\"Dry\", O44=\"\"),\"\",IF(AND(E44=\"PKE\",O44>3),\">3\",\"\"))","v":""},null,null,null,null,null,null,null,null,null,null,null,null,null,null,null,null,null,null,null,{"$f":"IF(OR($E45=\"-\",$H45=\"-\",$O46<=0,$AK44<=0,$Q$35=\"NO\"),\"\",IF(OR(#REF!=\"-\",$AS45=\"-\",$O46=0),\"\",($BY45*$O46)/100))","v":""}]
[null,null,null,null,null,null,null,null,null,null,null,null,null,null,null,null,null,null,null,null,null,null,null,null,null,null,null,null,null,null,null,{"$f":"IF($C47=\"Hay_Silage\",\"FT1_\",IF($C47=\"Concentrates\",\"FT2_\",IF($C47=\"By_products\",\"FT3_\",IF($C47=\"Fodder_beet_Default\",\"FT4_\",IF($C47=\"Other_Crops_Default\",\"FT5_\",IF($C47=\"Minerals\",\"FT6_\",IF($C47=\"Custom_Feeds_Minerals\",\"FT7_\",IF($C47=\"Custom_Bulb_Crops\",\"FT8_\",\"-\"))))))))","v":"-"},null,null,null,null,200,{"$f":"IF(OR($E47=\"\",$H47=\"\"),\"\",IF(AY46=\"\",IF(AY47>0,BZ47,0),BZ46))","v":""},null,{"$f":"IF(OR($E47=\"\",$H47=\"\",$K47=\"\",$O$6=\"\"),\"\",($K47/1000)*$O$6)","v":""},{"$f":"CA46","v":""},null,{"$f":"IF(OR($E47=\"\",$H47=\"\",$O47=\"\",$O$6=\"\"),\"\",($O47/1000)*$O$6)","v":""},{"$f":"CA47","v":""},null,null,{"$f":"IF(E47=\"\",\"\",E47)","v":""},{"$f":"IF(L47=\"\",\"\",1)","v":""},{"$f":"IF(OR($E47=\"\",$H47=\"\",$K47<=0),\"\",VLOOKUP($H47,'Data source'!$B$128:$C$188,2,FALSE))","v":""},{"$f":"IF(OR($E47=\"\",$H47=\"\",$K47<=0),0,K47*AW46)","v":0},{"$f":"IF(OR($E47=\"\",$H47=\"\",$K47=0),\"\",VLOOKUP($E47,'Data source'!$B$4:$I$111,3,FALSE))","v":""},{"$f":"IF(OR($E47=\"\",$H47=\"\",$K47=0),\"\",VLOOKUP($E47,'Data source'!$B$4:$I$111,2,FALSE))","v":""},{"$f":"IF(OR($E47=\"\",$H47=\"\",$K47<=0),\"\",AX46*AY46)","v":""},null,{"$f":"IF(OR($E47=\"\",$H47=\"\",$K47=0),\"\",VLOOKUP($E47,'Data source'!$B$4:$I$111,4,FALSE))","v":""},{"$f":"IF(OR($E47=\"\",$H47=\"\",$K47<=0),\"\",(($AX46/$AX$72)*BC46))","v":""},{"$f":"IF(OR($E47=\"\",$H47=\"\",$K47=0),\"\",VLOOKUP($E47,'Data source'!$B$4:$I$111,5,FALSE))","v":""},{"$f":"IF(OR($E47=\"\",$H47=\"\",$K47<=0),\"\",(($AX46/$AX$72)*BE46))","v":""},{"$f":"IF(OR($E47=\"\",$H47=\"\",$K47=0),\"\",VLOOKUP($E47,'Data source'!$B$4:$I$111,6,FALSE))","v":""},{"$f":"IF(OR($E47=\"\",$H47=\"\",$K47<=0),\"\",(($AX46/$AX$72)*BG46))","v":""},{"$f":"IF(OR($E47=\"\",$H47=\"\",$K47=0),\"\",VLOOKUP($E47,'Data source'!$B$4:$I$111,7,FALSE))","v":""},{"$f":"IF(OR($E47=\"\",$H47=\"\",$K47<=0),\"\",(BI46/100*BH46)*($AX46/$AX$72))","v":""},{"$f":"IF(OR($E47=\"\",$H47=\"\",$K47=0),\"\",VLOOKUP($E47,'Data source'!$B$4:$I$111,8,FALSE))","v":""},{"$f":"IF(OR($E47=\"\",$H47=\"\",$K47<=0),\"\",(($AX46/$AX$72)*BK46))","v":""},null,{"$f":"IF(OR($E47=\"\",$H47=\"\",$K47=0),0,VLOOKUP($E47,'Data source'!$B$4:$T$111,13,FALSE))","v":0},{"$f":"IF(OR($E47=\"\",$H47=\"\",$K47=0),0,VLOOKUP($E47,'Data source'!$B$4:$T$111,14,FALSE))","v":0},{"$f":"IF(OR($E47=\"\",$H47=\"\",$K47=0),0,VLOOKUP($E47,'Data source'!$B$4:$T$111,15,FALSE))","v":0},{"$f":"IF(OR($E47=\"\",$H47=\"\",$K47=0),0,VLOOKUP($E47,'Data source'!$B$4:$T$111,16,FALSE))","v":0},{"$f":"IF(OR($E47=\"\",$H47=\"\",$K47=0),0,VLOOKUP($E47,'Data source'!$B$4:$T$111,17,FALSE))","v":0},{"$f":"IF(OR($E47=\"\",$H47=\"\",$K47=0),0,VLOOKUP($E47,'Data source'!$B$4:$T$111,18,FALSE))","v":0},{"$f":"IF(OR($E47=\"\",$H47=\"\",$K47=0),0,VLOOKUP($E47,'Data source'!$B$4:$T$111,19,FALSE))","v":0},null,{"$f":"IF(OR($E47=\"\",$H47=\"\",$K47<=0),0,((43.498*$BN46)+(25.574*$BO46))-((28.206*$BP46)+(62.375*$BQ46)))*$AX46*10/1000","v":0},null,{"$f":"IF(OR($E47=\"\",$H47=\"\",$K47<=0,$AK46<=0),\"\",VLOOKUP($E47,'Data source'!$B$15:$M$111,12,FALSE))","v":""},{"$f":"IF(OR($E47=\"\",$H47=\"\",$K47<=0,$AK46<=0),\"\",IF($BX46=\"Dry\",$AK46/$AW46/10,IF($BX46=\"Wet\",$AK46/($AZ46/100)*$AW46/10,0)))","v":""},{"$f":"IF(OR($E47=\"\",$H47=\"\",$K47<=0,$AK46<=0,AY46=0),\"\",BY46/AY46)","v":""},{"$f":"IF(OR($E47=\"\",$H47=\"\",$K47<=0,$AK46<=0),\"\",($BY46*$K47)/100)","v":""}]
[null,null,null,{"$f":"IF(C47=\"Minerals\",\"i\",\"\")","v":""},null,null,null,null,null,{"$f":"IF(OR($C47=\"\",$E47=\"\",$H47=\"\"),\"\",VLOOKUP($H47,'Data source'!$B$128:$C$188,2,FALSE))","v":""},null,{"$f":"IF(OR(C47=\"\",E47=\"\",H47=\"\"),\"\",K47)","v":""},{"$f":"IF(AX46=0,\"\",AX46)","v":""},null,null,{"$f":"IF(OR(C47=\"\",E47=\"\",H47=\"\"),\"\",O47)","v":""},{"$f":"IF(AX47=0,\"\",AX47)","v":""},{"$f":"IF(OR(N48=\">3\",R48=\">3\"),\"i\",\"\")","v":""},null,null,null,null,"PROTEIN",{"$f":"IF(Y12=\"No\",\"\",CJ7)","v":""},{"$f":"IF(Y12=\"No\",\"\",CK7)","v":""},null,{"$f":"IF($K$72>0,BD72,\"\")","v":""},{"$f":"IF(OR(X47=\"\",AA47=\"\"),\"\",IF(AA47<(0.9*X47),\"i\",\"\"))","v":""},{"$f":"IF(AND($Q$35=\"YES\",$O$72>0),BD73,\"\")","v":""},{"$f":"IF(OR(X47=\"\",AC47=\"\"),\"\",IF(AC47<0.9*X47,\"i\",\"\"))","v":""},null,null,null,null,null,null,null,null,null,null,null,null,null,null,null,null,null,{"$f":"IF(OR(P47=\"\",$Q$35=\"NO\"),\"\",2)","v":""},{"$f":"IF(OR($E47=\"\",$H47=\"\",$O47<=0,$Q$35=\"NO\"),\"\",VLOOKUP($H47,'Data source'!$B$128:$C$188,2,FALSE))","v":""},{"$f":"IF(OR($E47=\"\",$H47=\"\",$O47<=0,$Q$35=\"NO\"),0,$O47*$AW47)","v":0},{"$f":"IF(OR($E47=\"\",$H47=\"\",$O47<=0,$Q$35=\"NO\"),\"\",VLOOKUP($E47,'Data source'!$B$4:$I$111,3,FALSE))","v":""},{"$f":"IF(OR($E47=\"\",$H47=\"\",$O47<=0,$Q$35=\"NO\"),\"\",VLOOKUP($E47,'Data source'!$B$4:$I$111,2,FALSE))","v":""},{"$f":"IF(OR($E47=\"\",$H47=\"\",$O47<=0,$Q$35=\"NO\"),\"\",$AX47*$AY47)","v":""},null,{"$f":"IF(OR($E47=\"\",$H47=\"\",$O47<=0,$Q$35=\"NO\"),\"\",VLOOKUP($E47,'Data source'!$B$4:$I$111,4,FALSE))","v":""},{"$f":"IF(OR($E47=\"\",$H47=\"\",$O47<=0,$Q$35=\"NO\"),\"\",(($AX47/$AX$73)*$BC47))","v":""},{"$f":"IF(OR($E47=\"\",$H47=\"\",$O47<=0,$Q$35=\"NO\"),\"\",VLOOKUP($E47,'Data source'!$B$4:$I$111,5,FALSE))","v":""},{"$f":"IF(OR($E47=\"\",$H47=\"\",$O47<=0,$Q$35=\"NO\"),\"\",(($AX47/$AX$73)*BE47))","v":""},{"$f":"IF(OR($E47=\"\",$H47=\"\",$O47<=0,$Q$35=\"NO\"),\"\",VLOOKUP($E47,'Data source'!$B$4:$I$111,6,FALSE))","v":""},{"$f":"IF(OR($E47=\"\",$H47=\"\",$O47<=0,$Q$35=\"NO\"),\"\",(($AX47/$AX$73)*BG47))","v":""},{"$f":"IF(OR($E47=\"\",$H47=\"\",$O47<=0,$Q$35=\"NO\"),\"\",VLOOKUP($E47,'Data source'!$B$4:$I$111,7,FALSE))","v":""},{"$f":"IF(OR($E47=\"\",$H47=\"\",$O47<=0,$Q$35=\"NO\"),\"\",(BI47/100*BH47)*($AX47/$AX$73))","v":""},{"$f":"IF(OR($E47=\"\",$H47=\"\",$O47<=0,$Q$35=\"NO\"),\"\",VLOOKUP($E47,'Data source'!$B$4:$I$111,8,FALSE))","v":""},{"$f":"IF(OR($E47=\"\",$H47=\"\",$O47<=0,$Q$35=\"NO\"),\"\",(($AX47/$AX$73)*BK47))","v":""},null,{"$f":"IF(OR($E47=\"\",$H47=\"\",$O47<=0,$Q$35=\"NO\"),0,VLOOKUP($E47,'Data source'!$B$4:$T$111,13,FALSE))","v":0},{"$f":"IF(OR($E47=\"\",$H47=\"\",$O47<=0,$Q$35=\"NO\"),0,VLOOKUP($E47,'Data source'!$B$4:$T$111,14,FALSE))","v":0},{"$f":"IF(OR($E47=\"\",$H47=\"\",$O47<=0,$Q$35=\"NO\"),0,VLOOKUP($E47,'Data source'!$B$4:$T$111,15,FALSE))","v":0},{"$f":"IF(OR($E47=\"\",$H47=\"\",$O47<=0,$Q$35=\"NO\"),0,VLOOKUP($E47,'Data source'!$B$4:$T$111,16,FALSE))","v":0},{"$f":"IF(OR($E47=\"\",$H47=\"\",$O47<=0,$Q$35=\"NO\"),0,VLOOKUP($E47,'Data source'!$B$4:$T$111,17,FALSE))","v":0},{"$f":"IF(OR($E47=\"\",$H47=\"\",$O47<=0,$Q$35=\"NO\"),0,VLOOKUP($E47,'Data source'!$B$4:$T$111,18,FALSE))","v":0},{"$f":"IF(OR($E47=\"\",$H47=\"\",$O47<=0,$Q$35=\"NO\"),0,VLOOKUP($E47,'Data source'!$B$4:$T$111,19,FALSE))","v":0},null,{"$f":"IF(OR($E47=\"\",$H47=\"\",$O47<=0,$Q$35=\"NO\"),0,((43.498*$BN47)+(25.574*$BO47))-((28.206*$BP47)+(62.375*$BQ47)))*$AX47*10/1000","v":0},null,{"$f":"IF(OR($E47=\"\",$H47=\"\",$O47<=0,$AK46<=0,$Q$35=\"NO\"),\"\",VLOOKUP($E47,'Data source'!$B$15:$M$104,12,FALSE))","v":""},{"$f":"IF(OR($E47=\"\",$H47=\"\",$O47<=0,$AK46<=0,$Q$35=\"NO\"),\"\",IF($BX47=\"Dry\",$AK46/$AW47/10,IF($BX47=\"Wet\",$AK46/($AZ47/100)*$AW47/10,0)))","v":""},{"$f":"IF(OR($E47=\"\",$H47=\"\",$O47<=0,$AK46<=0,AY47=0,$Q$35=\"NO\"),\"\",IF(OR($I23=\"-\",$AS47=\"-\",$O47=0),\"\",BY47/AY47))","v":""},{"$f":"IF(OR($E47=\"\",$H47=\"\",$O47<=0,$AK46<=0,$Q$35=\"NO\"),\"\",IF(OR($I23=\"-\",$AS47=\"-\",$O47=0),\"\",($BY47*$O47)/100))","v":""}]
[null,null,null,null,null,null,null,null,null,null,null,null,null,{"$f":"IF(OR($H$7=\"Dry\", K47=\"\"),\"\",IF(AND(E47=\"PKE\",K47>3),\">3\",\"\"))","v":""},null,null,null,{"$f":"IF(OR($H$7=\"Dry\", O47=\"\"),\"\",IF(AND(E47=\"PKE\",O47>3),\">3\",\"\"))","v":""},null,null,null,null,null,null,null,null,null,null,null,null,null,null,null,null,null,null,null,{"$f":"IF(OR($E48=\"-\",$H48=\"-\",$O49<=0,$AK47<=0,$Q$35=\"NO\"),\"\",IF(OR(#REF!=\"-\",$AS48=\"-\",$O49=0),\"\",($BY48*$O49)/100))","v":""}]
[null,null,null,null,null,null,null,null,null,null,null,null,null,null,null,null,null,null,null,null,null,null,null,null,null,null,null,null,null,null,null,{"$f":"IF($C50=\"Hay_Silage\",\"FT1_\",IF($C50=\"Concentrates\",\"FT2_\",IF($C50=\"By_products\",\"FT3_\",IF($C50=\"Fodder_beet_Default\",\"FT4_\",IF($C50=\"Other_Crops_Default\",\"FT5_\",IF($C50=\"Minerals\",\"FT6_\",IF($C50=\"Custom_Feeds_Minerals\",\"FT7_\",IF($C50=\"Custom_Bulb_Crops\",\"FT8_\",\"-\"))))))))","v":"-"},null,null,null,null,null,{"$f":"IF(OR($E50=\"\",$H50=\"\"),\"\",IF(AY49=\"\",IF(AY50>0,BZ50,0),BZ49))","v":""},null,{"$f":"IF(OR($E50=\"\",$H50=\"\",$K50=\"\",$O$6=\"\"),\"\",($K50/1000)*$O$6)","v":""},{"$f":"CA49","v":""},null,{"$f":"IF(OR($E50=\"\",$H50=\"\",$O50=\"\",$O$6=\"\"),\"\",($O50/1000)*$O$6)","v":""},{"$f":"CA50","v":""},null,null,{"$f":"IF(E50=\"\",\"\",E50)","v":""},{"$f":"IF(L50=\"\",\"\",1)","v":""},{"$f":"IF(OR($E50=\"\",$H50=\"\",$K50<=0),\"\",VLOOKUP($H50,'Data source'!$B$128:$C$188,2,FALSE))","v":""},{"$f":"IF(OR($E50=\"\",$H50=\"\",$K50<=0),0,K50*AW49)","v":0},{"$f":"IF(OR($E50=\"\",$H50=\"\",$K50=0),\"\",VLOOKUP($E50,'Data source'!$B$4:$I$111,3,FALSE))","v":""},{"$f":"IF(OR($E50=\"\",$H50=\"\",$K50=0),\"\",VLOOKUP($E50,'Data source'!$B$4:$I$111,2,FALSE))","v":""},{"$f":"IF(OR($E50=\"\",$H50=\"\",$K50<=0),\"\",AX49*AY49)","v":""},null,{"$f":"IF(OR($E50=\"\",$H50=\"\",$K50=0),\"\",VLOOKUP($E50,'Data source'!$B$4:$I$111,4,FALSE))","v":""},{"$f":"IF(OR($E50=\"\",$H50=\"\",$K50<=0),\"\",(($AX49/$AX$72)*BC49))","v":""},{"$f":"IF(OR($E50=\"\",$H50=\"\",$K50=0),\"\",VLOOKUP($E50,'Data source'!$B$4:$I$111,5,FALSE))","v":""},{"$f":"IF(OR($E50=\"\",$H50=\"\",$K50<=0),\"\",(($AX49/$AX$72)*BE49))","v":""},{"$f":"IF(OR($E50=\"\",$H50=\"\",$K50=0),\"\",VLOOKUP($E50,'Data source'!$B$4:$I$111,6,FALSE))","v":""},{"$f":"IF(OR($E50=\"\",$H50=\"\",$K50<=0),\"\",(($AX49/$AX$72)*BG49))","v":""},{"$f":"IF(OR($E50=\"\",$H50=\"\",$K50=0),\"\",VLOOKUP($E50,'Data source'!$B$4:$I$111,7,FALSE))","v":""},{"$f":"IF(OR($E50=\"\",$H50=\"\",$K50<=0),\"\",(BI49/100*BH49)*($AX49/$AX$72))","v":""},{"$f":"IF(OR($E50=\"\",$H50=\"\",$K50=0),\"\",VLOOKUP($E50,'Data source'!$B$4:$I$111,8,FALSE))","v":""},{"$f":"IF(OR($E50=\"\",$H50=\"\",$K50<=0),\"\",(($AX49/$AX$72)*BK49))","v":""},null,{"$f":"IF(OR($E50=\"\",$H50=\"\",$K50=0),0,VLOOKUP($E50,'Data source'!$B$4:$T$111,13,FALSE))","v":0},{"$f":"IF(OR($E50=\"\",$H50=\"\",$K50=0),0,VLOOKUP($E50,'Data source'!$B$4:$T$111,14,FALSE))","v":0},{"$f":"IF(OR($E50=\"\",$H50=\"\",$K50=0),0,VLOOKUP($E50,'Data source'!$B$4:$T$111,15,FALSE))","v":0},{"$f":"IF(OR($E50=\"\",$H50=\"\",$K50=0),0,VLOOKUP($E50,'Data source'!$B$4:$T$111,16,FALSE))","v":0},{"$f":"IF(OR($E50=\"\",$H50=\"\",$K50=0),0,VLOOKUP($E50,'Data source'!$B$4:$T$111,17,FALSE))","v":0},{"$f":"IF(OR($E50=\"\",$H50=\"\",$K50=0),0,VLOOKUP($E50,'Data source'!$B$4:$T$111,18,FALSE))","v":0},{"$f":"IF(OR($E50=\"\",$H50=\"\",$K50=0),0,VLOOKUP($E50,'Data source'!$B$4:$T$111,19,FALSE))","v":0},null,{"$f":"IF(OR($E50=\"\",$H50=\"\",$K50<=0),0,((43.498*$BN49)+(25.574*$BO49))-((28.206*$BP49)+(62.375*$BQ49)))*$AX49*10/1000","v":0},null,{"$f":"IF(OR($E50=\"\",$H50=\"\",$K50<=0,$AK49<=0),\"\",VLOOKUP($E50,'Data source'!$B$15:$M$104,12,FALSE))","v":""},{"$f":"IF(OR($E50=\"\",$H50=\"\",$K50<=0,$AK49<=0),\"\",IF($BX49=\"Dry\",$AK49/$AW49/10,IF($BX49=\"Wet\",$AK49/($AZ49/100)*$AW49/10,0)))","v":""},{"$f":"IF(OR($E50=\"\",$H50=\"\",$K50<=0,$AK49<=0,AY49=0),\"\",BY49/AY49)","v":""},{"$f":"IF(OR($E50=\"\",$H50=\"\",$K50<=0,$AK49<=0),\"\",($BY49*$K50)/100)","v":""}]
[null,null,null,{"$f":"IF(C50=\"Minerals\",\"i\",\"\")","v":""},null,null,null,null,null,{"$f":"IF(OR($C50=\"\",$E50=\"\",$H50=\"\"),\"\",VLOOKUP($H50,'Data source'!$B$128:$C$188,2,FALSE))","v":""},null,{"$f":"IF(OR(C50=\"\",E50=\"\",H50=\"\"),\"\",K50)","v":""},{"$f":"IF(AX49=0,\"\",AX49)","v":""},null,null,{"$f":"IF(OR(C50=\"\",E50=\"\",H50=\"\"),\"\",O50)","v":""},{"$f":"IF(AX50=0,\"\",AX50)","v":""},{"$f":"IF(OR(N51=\">3\",R51=\">3\"),\"i\",\"\")","v":""},null,null,null,null,"NDF",{"$f":"IF(Y12=\"No\",\"\",\">35\")","v":""},null,null,{"$f":"IF($K$72>0,BF72,\"\")","v":""},{"$f":"IF(OR(X50=\"\",AA50=\"\"),\"\",IF(AA50<=0.9*35,\"i\",IF(AA50>60/0.9,\"i\",\"\")))","v":""},{"$f":"IF(AND($Q$35=\"YES\",$O$72>0),BF73,\"\")","v":""},{"$f":"IF(OR(X50=\"\",AC50=\"\"),\"\",IF(AC50<=0.9*35,\"i\",IF(AC50>60/0.9,\"i\",\"\")))","v":""},null,null,null,null,null,null,null,null,null,null,null,null,null,null,null,null,null,{"$f":"IF(OR(P50=\"\",$Q$35=\"NO\"),\"\",2)","v":""},{"$f":"IF(OR($E50=\"\",$H50=\"\",$O50<=0,$Q$35=\"NO\"),\"\",VLOOKUP($H50,'Data source'!$B$128:$C$188,2,FALSE))","v":""},{"$f":"IF(OR($E50=\"\",$H50=\"\",$O50<=0,$Q$35=\"NO\"),0,$O50*$AW50)","v":0},{"$f":"IF(OR($E50=\"\",$H50=\"\",$O50<=0,$Q$35=\"NO\"),\"\",VLOOKUP($E50,'Data source'!$B$4:$I$111,3,FALSE))","v":""},{"$f":"IF(OR($E50=\"\",$H50=\"\",$O50<=0,$Q$35=\"NO\"),\"\",VLOOKUP($E50,'Data source'!$B$4:$I$111,2,FALSE))","v":""},{"$f":"IF(OR($E50=\"\",$H50=\"\",$O50<=0,$Q$35=\"NO\"),\"\",$AX50*$AY50)","v":""},null,{"$f":"IF(OR($E50=\"\",$H50=\"\",$O50<=0,$Q$35=\"NO\"),\"\",VLOOKUP($E50,'Data source'!$B$4:$I$111,4,FALSE))","v":""},{"$f":"IF(OR($E50=\"\",$H50=\"\",$O50<=0,$Q$35=\"NO\"),\"\",(($AX50/$AX$73)*$BC50))","v":""},{"$f":"IF(OR($E50=\"\",$H50=\"\",$O50<=0,$Q$35=\"NO\"),\"\",VLOOKUP($E50,'Data source'!$B$4:$I$111,5,FALSE))","v":""},{"$f":"IF(OR($E50=\"\",$H50=\"\",$O50<=0,$Q$35=\"NO\"),\"\",(($AX50/$AX$73)*BE50))","v":""},{"$f":"IF(OR($E50=\"\",$H50=\"\",$O50<=0,$Q$35=\"NO\"),\"\",VLOOKUP($E50,'Data source'!$B$4:$I$111,6,FALSE))","v":""},{"$f":"IF(OR($E50=\"\",$H50=\"\",$O50<=0,$Q$35=\"NO\"),\"\",(($AX50/$AX$73)*BG50))","v":""},{"$f":"IF(OR($E50=\"\",$H50=\"\",$O50<=0,$Q$35=\"NO\"),\"\",VLOOKUP($E50,'Data source'!$B$4:$I$111,7,FALSE))","v":""},{"$f":"IF(OR($E50=\"\",$H50=\"\",$O50<=0,$Q$35=\"NO\"),\"\",(BI50/100*BH50)*($AX50/$AX$73))","v":""},{"$f":"IF(OR($E50=\"\",$H50=\"\",$O50<=0,$Q$35=\"NO\"),\"\",VLOOKUP($E50,'Data source'!$B$4:$I$111,8,FALSE))","v":""},{"$f":"IF(OR($E50=\"\",$H50=\"\",$O50<=0,$Q$35=\"NO\"),\"\",(($AX50/$AX$73)*BK50))","v":""},null,{"$f":"IF(OR($E50=\"\",$H50=\"\",$O50<=0,$Q$35=\"NO\"),0,VLOOKUP($E50,'Data source'!$B$4:$T$111,13,FALSE))","v":0},{"$f":"IF(OR($E50=\"\",$H50=\"\",$O50<=0,$Q$35=\"NO\"),0,VLOOKUP($E50,'Data source'!$B$4:$T$111,14,FALSE))","v":0},{"$f":"IF(OR($E50=\"\",$H50=\"\",$O50<=0,$Q$35=\"NO\"),0,VLOOKUP($E50,'Data source'!$B$4:$T$111,15,FALSE))","v":0},{"$f":"IF(OR($E50=\"\",$H50=\"\",$O50<=0,$Q$35=\"NO\"),0,VLOOKUP($E50,'Data source'!$B$4:$T$111,16,FALSE))","v":0},{"$f":"IF(OR($E50=\"\",$H50=\"\",$O50<=0,$Q$35=\"NO\"),0,VLOOKUP($E50,'Data source'!$B$4:$T$111,17,FALSE))","v":0},{"$f":"IF(OR($E50=\"\",$H50=\"\",$O50<=0,$Q$35=\"NO\"),0,VLOOKUP($E50,'Data source'!$B$4:$T$111,18,FALSE))","v":0},{"$f":"IF(OR($E50=\"\",$H50=\"\",$O50<=0,$Q$35=\"NO\"),0,VLOOKUP($E50,'Data source'!$B$4:$T$111,19,FALSE))","v":0},null,{"$f":"IF(OR($E50=\"\",$H50=\"\",$O50<=0,$Q$35=\"NO\"),0,((43.498*$BN50)+(25.574*$BO50))-((28.206*$BP50)+(62.375*$BQ50)))*$AX50*10/1000","v":0},null,{"$f":"IF(OR($E50=\"\",$H50=\"\",$O50<=0,$AK49<=0,$Q$35=\"NO\"),\"\",VLOOKUP($E50,'Data source'!$B$15:$M$104,12,FALSE))","v":""},{"$f":"IF(OR($E50=\"\",$H50=\"\",$O50<=0,$AK49<=0,$Q$35=\"NO\"),\"\",IF($BX50=\"Dry\",$AK49/$AW50/10,IF($BX50=\"Wet\",$AK49/($AZ50/100)*$AW50/10,0)))","v":""},{"$f":"IF(OR($E50=\"\",$H50=\"\",$O50<=0,$AK49<=0,AY50=0,$Q$35=\"NO\"),\"\",IF(OR($I37=\"-\",$AS50=\"-\",$O50=0),\"\",BY50/AY50))","v":""},{"$f":"IF(OR($E50=\"\",$H50=\"\",$O50<=0,$AK49<=0,$Q$35=\"NO\"),\"\",IF(OR($I37=\"-\",$AS50=\"-\",$O50=0),\"\",($BY50*$O50)/100))","v":""}]
[null,null,null,null,null,null,null,null,null,null,null,null,null,{"$f":"IF(OR($H$7=\"Dry\", K50=\"\"),\"\",IF(AND(E50=\"PKE\",K50>3),\">3\",\"\"))","v":""},null,null,null,{"$f":"IF(OR($H$7=\"Dry\", O50=\"\"),\"\",IF(AND(E50=\"PKE\",O50>3),\">3\",\"\"))","v":""},null,null,null,null,null,null,null,null,null,null,null,null,null,null,null,null,null,null,null,{"$f":"IF(OR($E51=\"-\",$H51=\"-\",$O52<=0,$AK50<=0,$Q$35=\"NO\"),\"\",IF(OR(#REF!=\"-\",$AS51=\"-\",$O52=0),\"\",($BY51*$O52)/100))","v":""}]
[null,null,null,null,null,null,null,null,null,null,null,null,null,null,null,null,null,null,null,null,null,null,null,null,null,null,null,null,null,null,null,{"$f":"IF($C53=\"Hay_Silage\",\"FT1_\",IF($C53=\"Concentrates\",\"FT2_\",IF($C53=\"By_products\",\"FT3_\",IF($C53=\"Fodder_beet_Default\",\"FT4_\",IF($C53=\"Other_Crops_Default\",\"FT5_\",IF($C53=\"Minerals\",\"FT6_\",IF($C53=\"Custom_Feeds_Minerals\",\"FT7_\",IF($C53=\"Custom_Bulb_Crops\",\"FT8_\",\"-\"))))))))","v":"-"},null,null,null,null,null,{"$f":"IF(OR($E53=\"\",$H53=\"\"),\"\",IF(AY52=\"\",IF(AY53>0,BZ53,0),BZ52))","v":""},null,{"$f":"IF(OR($E53=\"\",$H53=\"\",$K53=\"\",$O$6=\"\"),\"\",($K53/1000)*$O$6)","v":""},{"$f":"CA52","v":""},null,{"$f":"IF(OR($E53=\"\",$H53=\"\",$O53=\"\",$O$6=\"\"),\"\",($O53/1000)*$O$6)","v":""},{"$f":"CA53","v":""},null,null,{"$f":"IF(E53=\"\",\"\",E53)","v":""},{"$f":"IF(L53=\"\",\"\",1)","v":""},{"$f":"IF(OR($E53=\"\",$H53=\"\",$K53<=0),\"\",VLOOKUP($H53,'Data source'!$B$128:$C$188,2,FALSE))","v":""},{"$f":"IF(OR($E53=\"\",$H53=\"\",$K53<=0),0,K53*AW52)","v":0},{"$f":"IF(OR($E53=\"\",$H53=\"\",$K53=0),\"\",VLOOKUP($E53,'Data source'!$B$4:$I$111,3,FALSE))","v":""},{"$f":"IF(OR($E53=\"\",$H53=\"\",$K53=0),\"\",VLOOKUP($E53,'Data source'!$B$4:$I$111,2,FALSE))","v":""},{"$f":"IF(OR($E53=\"\",$H53=\"\",$K53<=0),\"\",AX52*AY52)","v":""},null,{"$f":"IF(OR($E53=\"\",$H53=\"\",$K53=0),\"\",VLOOKUP($E53,'Data source'!$B$4:$I$111,4,FALSE))","v":""},{"$f":"IF(OR($E53=\"\",$H53=\"\",$K53<=0),\"\",(($AX52/$AX$72)*BC52))","v":""},{"$f":"IF(OR($E53=\"\",$H53=\"\",$K53=0),\"\",VLOOKUP($E53,'Data source'!$B$4:$I$111,5,FALSE))","v":""},{"$f":"IF(OR($E53=\"\",$H53=\"\",$K53<=0),\"\",(($AX52/$AX$72)*BE52))","v":""},{"$f":"IF(OR($E53=\"\",$H53=\"\",$K53=0),\"\",VLOOKUP($E53,'Data source'!$B$4:$I$111,6,FALSE))","v":""},{"$f":"IF(OR($E53=\"\",$H53=\"\",$K53<=0),\"\",(($AX52/$AX$72)*BG52))","v":""},{"$f":"IF(OR($E53=\"\",$H53=\"\",$K53=0),\"\",VLOOKUP($E53,'Data source'!$B$4:$I$111,7,FALSE))","v":""},{"$f":"IF(OR($E53=\"\",$H53=\"\",$K53<=0),\"\",(BI52/100*BH52)*($AX52/$AX$72))","v":""},{"$f":"IF(OR($E53=\"\",$H53=\"\",$K53=0),\"\",VLOOKUP($E53,'Data source'!$B$4:$I$111,8,FALSE))","v":""},{"$f":"IF(OR($E53=\"\",$H53=\"\",$K53<=0),\"\",(($AX52/$AX$72)*BK52))","v":""},null,{"$f":"IF(OR($E53=\"\",$H53=\"\",$K53=0),0,VLOOKUP($E53,'Data source'!$B$4:$T$111,13,FALSE))","v":0},{"$f":"IF(OR($E53=\"\",$H53=\"\",$K53=0),0,VLOOKUP($E53,'Data source'!$B$4:$T$111,14,FALSE))","v":0},{"$f":"IF(OR($E53=\"\",$H53=\"\",$K53=0),0,VLOOKUP($E53,'Data source'!$B$4:$T$111,15,FALSE))","v":0},{"$f":"IF(OR($E53=\"\",$H53=\"\",$K53=0),0,VLOOKUP($E53,'Data source'!$B$4:$T$111,16,FALSE))","v":0},{"$f":"IF(OR($E53=\"\",$H53=\"\",$K53=0),0,VLOOKUP($E53,'Data source'!$B$4:$T$111,17,FALSE))","v":0},{"$f":"IF(OR($E53=\"\",$H53=\"\",$K53=0),0,VLOOKUP($E53,'Data source'!$B$4:$T$111,18,FALSE))","v":0},{"$f":"IF(OR($E53=\"\",$H53=\"\",$K53=0),0,VLOOKUP($E53,'Data source'!$B$4:$T$111,19,FALSE))","v":0},null,{"$f":"IF(OR($E53=\"\",$H53=\"\",$K53<=0),0,((43.498*$BN52)+(25.574*$BO52))-((28.206*$BP52)+(62.375*$BQ52)))*$AX52*10/1000","v":0},null,{"$f":"IF(OR($E53=\"\",$H53=\"\",$K53<=0,$AK52<=0),\"\",VLOOKUP($E53,'Data source'!$B$15:$M$104,12,FALSE))","v":""},{"$f":"IF(OR($E53=\"\",$H53=\"\",$K53<=0,$AK52<=0),\"\",IF($BX52=\"Dry\",$AK52/$AW52/10,IF($BX52=\"Wet\",$AK52/($AZ52/100)*$AW52/10,0)))","v":""},{"$f":"IF(OR($E53=\"\",$H53=\"\",$K53<=0,$AK52<=0,AY52=0),\"\",BY52/AY52)","v":""},{"$f":"IF(OR($E53=\"\",$H53=\"\",$K53<=0,$AK52<=0),\"\",($BY52*$K53)/100)","v":""}]
[null,null,null,{"$f":"IF(C53=\"Minerals\",\"i\",\"\")","v":""},null,null,null,null,null,{"$f":"IF(OR($C53=\"\",$E53=\"\",$H53=\"\"),\"\",VLOOKUP($H53,'Data source'!$B$128:$C$188,2,FALSE))","v":""},null,{"$f":"IF(OR(C53=\"\",E53=\"\",H53=\"\"),\"\",K53)","v":""},{"$f":"IF(AX52=0,\"\",AX52)","v":""},null,null,{"$f":"IF(OR(C53=\"\",E53=\"\",H53=\"\"),\"\",O53)","v":""},{"$f":"IF(AX53=0,\"\",AX53)","v":""},{"$f":"IF(OR(N54=\">3\",R54=\">3\"),\"i\",\"\")","v":""},null,null,null,null,"SSS",{"$f":"IF(Y12=\"No\",\"\",\"<38\")","v":""},null,null,{"$f":"IF($K$72>0,BH72,\"\")","v":""},{"$f":"IF(OR(X53=\"\",AA53=\"\"),\"\",IF(AA53>=38/0.9,\"i\",\"\"))","v":""},{"$f":"IF(AND($Q$35=\"YES\",$O$72>0),BH73,\"\")","v":""},{"$f":"IF(OR(X53=\"\",AC53=\"\"),\"\",IF(AC53>=38/0.9,\"i\",\"\"))","v":""},null,null,null,null,null,null,null,null,null,null,null,null,null,null,null,null,null,{"$f":"IF(OR(P53=\"\",$Q$35=\"NO\"),\"\",2)","v":""},{"$f":"IF(OR($E53=\"\",$H53=\"\",$O53<=0,$Q$35=\"NO\"),\"\",VLOOKUP($H53,'Data source'!$B$128:$C$188,2,FALSE))","v":""},{"$f":"IF(OR($E53=\"\",$H53=\"\",$O53<=0,$Q$35=\"NO\"),0,$O53*$AW53)","v":0},{"$f":"IF(OR($E53=\"\",$H53=\"\",$O53<=0,$Q$35=\"NO\"),\"\",VLOOKUP($E53,'Data source'!$B$4:$I$111,3,FALSE))","v":""},{"$f":"IF(OR($E53=\"\",$H53=\"\",$O53<=0,$Q$35=\"NO\"),\"\",VLOOKUP($E53,'Data source'!$B$4:$I$111,2,FALSE))","v":""},{"$f":"IF(OR($E53=\"\",$H53=\"\",$O53<=0,$Q$35=\"NO\"),\"\",$AX53*$AY53)","v":""},null,{"$f":"IF(OR($E53=\"\",$H53=\"\",$O53<=0,$Q$35=\"NO\"),\"\",VLOOKUP($E53,'Data source'!$B$4:$I$111,4,FALSE))","v":""},{"$f":"IF(OR($E53=\"\",$H53=\"\",$O53<=0,$Q$35=\"NO\"),\"\",(($AX53/$AX$73)*$BC53))","v":""},{"$f":"IF(OR($E53=\"\",$H53=\"\",$O53<=0,$Q$35=\"NO\"),\"\",VLOOKUP($E53,'Data source'!$B$4:$I$111,5,FALSE))","v":""},{"$f":"IF(OR($E53=\"\",$H53=\"\",$O53<=0,$Q$35=\"NO\"),\"\",(($AX53/$AX$73)*BE53))","v":""},{"$f":"IF(OR($E53=\"\",$H53=\"\",$O53<=0,$Q$35=\"NO\"),\"\",VLOOKUP($E53,'Data source'!$B$4:$I$111,6,FALSE))","v":""},{"$f":"IF(OR($E53=\"\",$H53=\"\",$O53<=0,$Q$35=\"NO\"),\"\",(($AX53/$AX$73)*BG53))","v":""},{"$f":"IF(OR($E53=\"\",$H53=\"\",$O53<=0,$Q$35=\"NO\"),\"\",VLOOKUP($E53,'Data source'!$B$4:$I$111,7,FALSE))","v":""},{"$f":"IF(OR($E53=\"\",$H53=\"\",$O53<=0,$Q$35=\"NO\"),\"\",(BI53/100*BH53)*($AX53/$AX$73))","v":""},{"$f":"IF(OR($E53=\"\",$H53=\"\",$O53<=0,$Q$35=\"NO\"),\"\",VLOOKUP($E53,'Data source'!$B$4:$I$111,8,FALSE))","v":""},{"$f":"IF(OR($E53=\"\",$H53=\"\",$O53<=0,$Q$35=\"NO\"),\"\",(($AX53/$AX$73)*BK53))","v":""},null,{"$f":"IF(OR($E53=\"\",$H53=\"\",$O53<=0,$Q$35=\"NO\"),0,VLOOKUP($E53,'Data source'!$B$4:$T$111,13,FALSE))","v":0},{"$f":"IF(OR($E53=\"\",$H53=\"\",$O53<=0,$Q$35=\"NO\"),0,VLOOKUP($E53,'Data source'!$B$4:$T$111,14,FALSE))","v":0},{"$f":"IF(OR($E53=\"\",$H53=\"\",$O53<=0,$Q$35=\"NO\"),0,VLOOKUP($E53,'Data source'!$B$4:$T$111,15,FALSE))","v":0},{"$f":"IF(OR($E53=\"\",$H53=\"\",$O53<=0,$Q$35=\"NO\"),0,VLOOKUP($E53,'Data source'!$B$4:$T$111,16,FALSE))","v":0},{"$f":"IF(OR($E53=\"\",$H53=\"\",$O53<=0,$Q$35=\"NO\"),0,VLOOKUP($E53,'Data source'!$B$4:$T$111,17,FALSE))","v":0},{"$f":"IF(OR($E53=\"\",$H53=\"\",$O53<=0,$Q$35=\"NO\"),0,VLOOKUP($E53,'Data source'!$B$4:$T$111,18,FALSE))","v":0},{"$f":"IF(OR($E53=\"\",$H53=\"\",$O53<=0,$Q$35=\"NO\"),0,VLOOKUP($E53,'Data source'!$B$4:$T$111,19,FALSE))","v":0},null,{"$f":"IF(OR($E53=\"\",$H53=\"\",$O53<=0,$Q$35=\"NO\"),0,((43.498*$BN53)+(25.574*$BO53))-((28.206*$BP53)+(62.375*$BQ53)))*$AX53*10/1000","v":0},null,{"$f":"IF(OR($E53=\"\",$H53=\"\",$O53<=0,$AK52<=0,$Q$35=\"NO\"),\"\",VLOOKUP($E53,'Data source'!$B$15:$M$104,12,FALSE))","v":""},{"$f":"IF(OR($E53=\"\",$H53=\"\",$O53<=0,$AK52<=0,$Q$35=\"NO\"),\"\",IF($BX53=\"Dry\",$AK52/$AW53/10,IF($BX53=\"Wet\",$AK52/($AZ53/100)*$AW53/10,0)))","v":""},{"$f":"IF(OR($E53=\"\",$H53=\"\",$O53<=0,$AK52<=0,AY53=0,$Q$35=\"NO\"),\"\",IF(OR($I41=\"-\",$AS53=\"-\",$O53=0),\"\",BY53/AY53))","v":""},{"$f":"IF(OR($E53=\"\",$H53=\"\",$O53<=0,$AK52<=0,$Q$35=\"NO\"),\"\",IF(OR($I41=\"-\",$AS53=\"-\",$O53=0),\"\",($BY53*$O53)/100))","v":""}]
[null,null,null,null,null,null,null,null,null,null,null,null,null,{"$f":"IF(OR($H$7=\"Dry\", K53=\"\"),\"\",IF(AND(E53=\"PKE\",K53>3),\">3\",\"\"))","v":""},null,null,null,{"$f":"IF(OR($H$7=\"Dry\", O53=\"\"),\"\",IF(AND(E53=\"PKE\",O53>3),\">3\",\"\"))","v":""},null,null,null,null,null,null,null,null,null,null,null,null,null,null,null,null,null,null,null,{"$f":"IF(OR($E54=\"-\",$H54=\"-\",$O55<=0,$AK53<=0,$Q$35=\"NO\"),\"\",IF(OR(#REF!=\"-\",$AS54=\"-\",$O55=0),\"\",($BY54*$O55)/100))","v":""}]
[null,null,null,null,null,null,null,null,null,null,null,null,null,null,null,null,null,null,null,null,null,null,null,null,null,null,null,null,null,null,null,{"$f":"IF($C56=\"Hay_Silage\",\"FT1_\",IF($C56=\"Concentrates\",\"FT2_\",IF($C56=\"By_products\",\"FT3_\",IF($C56=\"Fodder_beet_Default\",\"FT4_\",IF($C56=\"Other_Crops_Default\",\"FT5_\",IF($C56=\"Minerals\",\"FT6_\",IF($C56=\"Custom_Feeds_Minerals\",\"FT7_\",IF($C56=\"Custom_Bulb_Crops\",\"FT8_\",\"-\"))))))))","v":"-"},null,null,null,null,null,{"$f":"IF(OR($E56=\"\",$H56=\"\"),\"\",IF(AY55=\"\",IF(AY56>0,BZ56,0),BZ55))","v":""},null,{"$f":"IF(OR($E56=\"\",$H56=\"\",$K56=\"\",$O$6=\"\"),\"\",($K56/1000)*$O$6)","v":""},{"$f":"CA55","v":""},null,{"$f":"IF(OR($E56=\"\",$H56=\"\",$O56=\"\",$O$6=\"\"),\"\",($O56/1000)*$O$6)","v":""},{"$f":"CA56","v":""},null,null,{"$f":"IF(E56=\"\",\"\",E56)","v":""},{"$f":"IF(L56=\"\",\"\",1)","v":""},{"$f":"IF(OR($E56=\"\",$H56=\"\",$K56<=0),\"\",VLOOKUP($H56,'Data source'!$B$128:$C$188,2,FALSE))","v":""},{"$f":"IF(OR($E56=\"\",$H56=\"\",$K56<=0),0,K56*AW55)","v":0},{"$f":"IF(OR($E56=\"\",$H56=\"\",$K56=0),\"\",VLOOKUP($E56,'Data source'!$B$4:$I$111,3,FALSE))","v":""},{"$f":"IF(OR($E56=\"\",$H56=\"\",$K56=0),\"\",VLOOKUP($E56,'Data source'!$B$4:$I$111,2,FALSE))","v":""},{"$f":"IF(OR($E56=\"\",$H56=\"\",$K56<=0),\"\",AX55*AY55)","v":""},null,{"$f":"IF(OR($E56=\"\",$H56=\"\",$K56=0),\"\",VLOOKUP($E56,'Data source'!$B$4:$I$111,4,FALSE))","v":""},{"$f":"IF(OR($E56=\"\",$H56=\"\",$K56<=0),\"\",(($AX55/$AX$72)*BC55))","v":""},{"$f":"IF(OR($E56=\"\",$H56=\"\",$K56=0),\"\",VLOOKUP($E56,'Data source'!$B$4:$I$111,5,FALSE))","v":""},{"$f":"IF(OR($E56=\"\",$H56=\"\",$K56<=0),\"\",(($AX55/$AX$72)*BE55))","v":""},{"$f":"IF(OR($E56=\"\",$H56=\"\",$K56=0),\"\",VLOOKUP($E56,'Data source'!$B$4:$I$111,6,FALSE))","v":""},{"$f":"IF(OR($E56=\"\",$H56=\"\",$K56<=0),\"\",(($AX55/$AX$72)*BG55))","v":""},{"$f":"IF(OR($E56=\"\",$H56=\"\",$K56=0),\"\",VLOOKUP($E56,'Data source'!$B$4:$I$111,7,FALSE))","v":""},{"$f":"IF(OR($E56=\"\",$H56=\"\",$K56<=0),\"\",(BI55/100*BH55)*($AX55/$AX$72))","v":""},{"$f":"IF(OR($E56=\"\",$H56=\"\",$K56=0),\"\",VLOOKUP($E56,'Data source'!$B$4:$I$111,8,FALSE))","v":""},{"$f":"IF(OR($E56=\"\",$H56=\"\",$K56<=0),\"\",(($AX55/$AX$72)*BK55))","v":""},null,{"$f":"IF(OR($E56=\"\",$H56=\"\",$K56=0),0,VLOOKUP($E56,'Data source'!$B$4:$T$111,13,FALSE))","v":0},{"$f":"IF(OR($E56=\"\",$H56=\"\",$K56=0),0,VLOOKUP($E56,'Data source'!$B$4:$T$111,14,FALSE))","v":0},{"$f":"IF(OR($E56=\"\",$H56=\"\",$K56=0),0,VLOOKUP($E56,'Data source'!$B$4:$T$111,15,FALSE))","v":0},{"$f":"IF(OR($E56=\"\",$H56=\"\",$K56=0),0,VLOOKUP($E56,'Data source'!$B$4:$T$111,16,FALSE))","v":0},{"$f":"IF(OR($E56=\"\",$H56=\"\",$K56=0),0,VLOOKUP($E56,'Data source'!$B$4:$T$111,17,FALSE))","v":0},{"$f":"IF(OR($E56=\"\",$H56=\"\",$K56=0),0,VLOOKUP($E56,'Data source'!$B$4:$T$111,18,FALSE))","v":0},{"$f":"IF(OR($E56=\"\",$H56=\"\",$K56=0),0,VLOOKUP($E56,'Data source'!$B$4:$T$111,19,FALSE))","v":0},null,{"$f":"IF(OR($E56=\"\",$H56=\"\",$K56<=0),0,((43.498*$BN55)+(25.574*$BO55))-((28.206*$BP55)+(62.375*$BQ55)))*$AX55*10/1000","v":0},null,{"$f":"IF(OR($E56=\"\",$H56=\"\",$K56<=0,$AK55<=0),\"\",VLOOKUP($E56,'Data source'!$B$15:$M$104,12,FALSE))","v":""},{"$f":"IF(OR($E56=\"\",$H56=\"\",$K56<=0,$AK55<=0),\"\",IF($BX55=\"Dry\",$AK55/$AW55/10,IF($BX55=\"Wet\",$AK55/($AZ55/100)*$AW55/10,0)))","v":""},{"$f":"IF(OR($E56=\"\",$H56=\"\",$K56<=0,$AK55<=0,AY55=0),\"\",BY55/AY55)","v":""},{"$f":"IF(OR($E56=\"\",$H56=\"\",$K56<=0,$AK55<=0),\"\",($BY55*$K56)/100)","v":""}]
[null,null,null,{"$f":"IF(C56=\"Minerals\",\"i\",\"\")","v":""},null,null,null,null,null,{"$f":"IF(OR($C56=\"\",$E56=\"\",$H56=\"\"),\"\",VLOOKUP($H56,'Data source'!$B$128:$C$188,2,FALSE))","v":""},null,{"$f":"IF(OR(C56=\"\",E56=\"\",H56=\"\"),\"\",K56)","v":""},{"$f":"IF(AX55=0,\"\",AX55)","v":""},null,null,{"$f":"IF(OR(C56=\"\",E56=\"\",H56=\"\"),\"\",O56)","v":""},{"$f":"IF(AX56=0,\"\",AX56)","v":""},{"$f":"IF(OR(N57=\">3\",R57=\">3\"),\"i\",\"\")","v":""},null,null,null,null,"STARCH",{"$f":"IF(Y12=\"No\",\"\",\"<30\")","v":""},null,null,{"$f":"IF($K$72>0,BJ72,\"\")","v":""},{"$f":"IF(OR(X56=\"\",AA56=\"\"),\"\",IF(AA56>=30/0.9,\"i\",\"\"))","v":""},{"$f":"IF(AND($Q$35=\"YES\",$O$72>0),BJ73,\"\")","v":""},{"$f":"IF(OR(X56=\"\",AC56=\"\"),\"\",IF(AC56>=30/0.9,\"i\",\"\"))","v":""},null,null,null,null,null,null,null,null,null,null,null,null,null,null,null,null,null,{"$f":"IF(OR(P56=\"\",$Q$35=\"NO\"),\"\",2)","v":""},{"$f":"IF(OR($E56=\"\",$H56=\"\",$O56<=0,$Q$35=\"NO\"),\"\",VLOOKUP($H56,'Data source'!$B$128:$C$188,2,FALSE))","v":""},{"$f":"IF(OR($E56=\"\",$H56=\"\",$O56<=0,$Q$35=\"NO\"),0,$O56*$AW56)","v":0},{"$f":"IF(OR($E56=\"\",$H56=\"\",$O56<=0,$Q$35=\"NO\"),\"\",VLOOKUP($E56,'Data source'!$B$4:$I$111,3,FALSE))","v":""},{"$f":"IF(OR($E56=\"\",$H56=\"\",$O56<=0,$Q$35=\"NO\"),\"\",VLOOKUP($E56,'Data source'!$B$4:$I$111,2,FALSE))","v":""},{"$f":"IF(OR($E56=\"\",$H56=\"\",$O56<=0,$Q$35=\"NO\"),\"\",$AX56*$AY56)","v":""},null,{"$f":"IF(OR($E56=\"\",$H56=\"\",$O56<=0,$Q$35=\"NO\"),\"\",VLOOKUP($E56,'Data source'!$B$4:$I$111,4,FALSE))","v":""},{"$f":"IF(OR($E56=\"\",$H56=\"\",$O56<=0,$Q$35=\"NO\"),\"\",(($AX56/$AX$73)*$BC56))","v":""},{"$f":"IF(OR($E56=\"\",$H56=\"\",$O56<=0,$Q$35=\"NO\"),\"\",VLOOKUP($E56,'Data source'!$B$4:$I$111,5,FALSE))","v":""},{"$f":"IF(OR($E56=\"\",$H56=\"\",$O56<=0,$Q$35=\"NO\"),\"\",(($AX56/$AX$73)*BE56))","v":""},{"$f":"IF(OR($E56=\"\",$H56=\"\",$O56<=0,$Q$35=\"NO\"),\"\",VLOOKUP($E56,'Data source'!$B$4:$I$111,6,FALSE))","v":""},{"$f":"IF(OR($E56=\"\",$H56=\"\",$O56<=0,$Q$35=\"NO\"),\"\",(($AX56/$AX$73)*BG56))","v":""},{"$f":"IF(OR($E56=\"\",$H56=\"\",$O56<=0,$Q$35=\"NO\"),\"\",VLOOKUP($E56,'Data source'!$B$4:$I$111,7,FALSE))","v":""},{"$f":"IF(OR($E56=\"\",$H56=\"\",$O56<=0,$Q$35=\"NO\"),\"\",(BI56/100*BH56)*($AX56/$AX$73))","v":""},{"$f":"IF(OR($E56=\"\",$H56=\"\",$O56<=0,$Q$35=\"NO\"),\"\",VLOOKUP($E56,'Data source'!$B$4:$I$111,8,FALSE))","v":""},{"$f":"IF(OR($E56=\"\",$H56=\"\",$O56<=0,$Q$35=\"NO\"),\"\",(($AX56/$AX$73)*BK56))","v":""},null,{"$f":"IF(OR($E56=\"\",$H56=\"\",$O56<=0,$Q$35=\"NO\"),0,VLOOKUP($E56,'Data source'!$B$4:$T$111,13,FALSE))","v":0},{"$f":"IF(OR($E56=\"\",$H56=\"\",$O56<=0,$Q$35=\"NO\"),0,VLOOKUP($E56,'Data source'!$B$4:$T$111,14,FALSE))","v":0},{"$f":"IF(OR($E56=\"\",$H56=\"\",$O56<=0,$Q$35=\"NO\"),0,VLOOKUP($E56,'Data source'!$B$4:$T$111,15,FALSE))","v":0},{"$f":"IF(OR($E56=\"\",$H56=\"\",$O56<=0,$Q$35=\"NO\"),0,VLOOKUP($E56,'Data source'!$B$4:$T$111,17,FALSE))","v":0},{"$f":"IF(OR($E56=\"\",$H56=\"\",$O56<=0,$Q$35=\"NO\"),0,VLOOKUP($E56,'Data source'!$B$4:$T$111,17,FALSE))","v":0},{"$f":"IF(OR($E56=\"\",$H56=\"\",$O56<=0,$Q$35=\"NO\"),0,VLOOKUP($E56,'Data source'!$B$4:$T$111,18,FALSE))","v":0},{"$f":"IF(OR($E56=\"\",$H56=\"\",$O56<=0,$Q$35=\"NO\"),0,VLOOKUP($E56,'Data source'!$B$4:$T$111,19,FALSE))","v":0},null,{"$f":"IF(OR($E56=\"\",$H56=\"\",$O56<=0,$Q$35=\"NO\"),0,((43.498*$BN56)+(25.574*$BO56))-((28.206*$BP56)+(62.375*$BQ56)))*$AX56*10/1000","v":0},null,{"$f":"IF(OR($E56=\"\",$H56=\"\",$O56<=0,$AK55<=0,$Q$35=\"NO\"),\"\",VLOOKUP($E56,'Data source'!$B$15:$M$104,12,FALSE))","v":""},{"$f":"IF(OR($E56=\"\",$H56=\"\",$O56<=0,$AK55<=0,$Q$35=\"NO\"),\"\",IF($BX56=\"Dry\",$AK55/$AW56/10,IF($BX56=\"Wet\",$AK55/($AZ56/100)*$AW56/10,0)))","v":""},{"$f":"IF(OR($E56=\"\",$H56=\"\",$O56<=0,$AK55<=0,AY56=0,$Q$35=\"NO\"),\"\",IF(OR($I44=\"-\",$AS56=\"-\",$O56=0),\"\",BY56/AY56))","v":""},{"$f":"IF(OR($E56=\"\",$H56=\"\",$O56<=0,$AK55<=0,$Q$35=\"NO\"),\"\",IF(OR($I44=\"-\",$AS56=\"-\",$O56=0),\"\",($BY56*$O56)/100))","v":""}]
[null,null,null,null,null,null,null,null,null,null,null,null,null,{"$f":"IF(OR($H$7=\"Dry\", K56=\"\"),\"\",IF(AND(E56=\"PKE\",K56>3),\">3\",\"\"))","v":""},null,null,null,{"$f":"IF(OR($H$7=\"Dry\", O56=\"\"),\"\",IF(AND(E56=\"PKE\",O56>3),\">3\",\"\"))","v":""},null,null,null,null,null,null,null,null,null,null,null,null,null,null,null,null,null,null,null,{"$f":"IF(OR($E57=\"-\",$H57=\"-\",$O58<=0,$AK56<=0,$Q$35=\"NO\"),\"\",IF(OR(#REF!=\"-\",$AS57=\"-\",$O58=0),\"\",($BY57*$O58)/100))","v":""}]
[null,null,null,null,null,null,null,null,null,null,null,null,null,null,null,null,null,null,null,null,null,null,null,null,null,null,null,null,null,null,null,{"$f":"IF($C59=\"Hay_Silage\",\"FT1_\",IF($C59=\"Concentrates\",\"FT2_\",IF($C59=\"By_products\",\"FT3_\",IF($C59=\"Fodder_beet_Default\",\"FT4_\",IF($C59=\"Other_Crops_Default\",\"FT5_\",IF($C59=\"Minerals\",\"FT6_\",IF($C59=\"Custom_Feeds_Minerals\",\"FT7_\",IF($C59=\"Custom_Bulb_Crops\",\"FT8_\",\"-\"))))))))","v":"-"},null,null,null,null,null,{"$f":"IF(OR($E59=\"\",$H59=\"\"),\"\",IF(AY58=\"\",IF(AY59>0,BZ59,0),BZ58))","v":""},null,{"$f":"IF(OR($E59=\"\",$H59=\"\",$K59=\"\",$O$6=\"\"),\"\",($K59/1000)*$O$6)","v":""},{"$f":"CA58","v":""},null,{"$f":"IF(OR($E59=\"\",$H59=\"\",$O59=\"\",$O$6=\"\"),\"\",($O59/1000)*$O$6)","v":""},{"$f":"CA59","v":""},null,null,{"$f":"IF(E59=\"\",\"\",E59)","v":""},{"$f":"IF(L59=\"\",\"\",1)","v":""},{"$f":"IF(OR($E59=\"\",$H59=\"\",$K59<=0),\"\",VLOOKUP($H59,'Data source'!$B$128:$C$188,2,FALSE))","v":""},{"$f":"IF(OR($E59=\"\",$H59=\"\",$K59<=0),0,K59*AW58)","v":0},{"$f":"IF(OR($E59=\"\",$H59=\"\",$K59=0),\"\",VLOOKUP($E59,'Data source'!$B$4:$I$111,3,FALSE))","v":""},{"$f":"IF(OR($E59=\"\",$H59=\"\",$K59=0),\"\",VLOOKUP($E59,'Data source'!$B$4:$I$111,2,FALSE))","v":""},{"$f":"IF(OR($E59=\"\",$H59=\"\",$K59<=0),\"\",AX58*AY58)","v":""},null,{"$f":"IF(OR($E59=\"\",$H59=\"\",$K59=0),\"\",VLOOKUP($E59,'Data source'!$B$4:$I$111,4,FALSE))","v":""},{"$f":"IF(OR($E59=\"\",$H59=\"\",$K59<=0),\"\",(($AX58/$AX$72)*BC58))","v":""},{"$f":"IF(OR($E59=\"\",$H59=\"\",$K59=0),\"\",VLOOKUP($E59,'Data source'!$B$4:$I$111,5,FALSE))","v":""},{"$f":"IF(OR($E59=\"\",$H59=\"\",$K59<=0),\"\",(($AX58/$AX$72)*BE58))","v":""},{"$f":"IF(OR($E59=\"\",$H59=\"\",$K59=0),\"\",VLOOKUP($E59,'Data source'!$B$4:$I$111,6,FALSE))","v":""},{"$f":"IF(OR($E59=\"\",$H59=\"\",$K59<=0),\"\",(($AX58/$AX$72)*BG58))","v":""},{"$f":"IF(OR($E59=\"\",$H59=\"\",$K59=0),\"\",VLOOKUP($E59,'Data source'!$B$4:$I$111,7,FALSE))","v":""},{"$f":"IF(OR($E59=\"\",$H59=\"\",$K59<=0),\"\",(BI58/100*BH58)*($AX58/$AX$72))","v":""},{"$f":"IF(OR($E59=\"\",$H59=\"\",$K59=0),\"\",VLOOKUP($E59,'Data source'!$B$4:$I$111,8,FALSE))","v":""},{"$f":"IF(OR($E59=\"\",$H59=\"\",$K59<=0),\"\",(($AX58/$AX$72)*BK58))","v":""},null,{"$f":"IF(OR($E59=\"\",$H59=\"\",$K59=0),0,VLOOKUP($E59,'Data source'!$B$4:$T$111,13,FALSE))","v":0},{"$f":"IF(OR($E59=\"\",$H59=\"\",$K59=0),0,VLOOKUP($E59,'Data source'!$B$4:$T$111,14,FALSE))","v":0},{"$f":"IF(OR($E59=\"\",$H59=\"\",$K59=0),0,VLOOKUP($E59,'Data source'!$B$4:$T$111,15,FALSE))","v":0},{"$f":"IF(OR($E59=\"\",$H59=\"\",$K59=0),0,VLOOKUP($E59,'Data source'!$B$4:$T$111,16,FALSE))","v":0},{"$f":"IF(OR($E59=\"\",$H59=\"\",$K59=0),0,VLOOKUP($E59,'Data source'!$B$4:$T$111,17,FALSE))","v":0},{"$f":"IF(OR($E59=\"\",$H59=\"\",$K59=0),0,VLOOKUP($E59,'Data source'!$B$4:$T$111,18,FALSE))","v":0},{"$f":"IF(OR($E59=\"\",$H59=\"\",$K59=0),0,VLOOKUP($E59,'Data source'!$B$4:$T$111,19,FALSE))","v":0},null,{"$f":"IF(OR($E59=\"\",$H59=\"\",$K59<=0),0,((43.498*$BN58)+(25.574*$BO58))-((28.206*$BP58)+(62.375*$BQ58)))*$AX58*10/1000","v":0},null,{"$f":"IF(OR($E59=\"\",$H59=\"\",$K59<=0,$AK58<=0),\"\",VLOOKUP($E59,'Data source'!$B$15:$M$104,12,FALSE))","v":""},{"$f":"IF(OR($E59=\"\",$H59=\"\",$K59<=0,$AK58<=0),\"\",IF($BX58=\"Dry\",$AK58/$AW58/10,IF($BX58=\"Wet\",$AK58/($AZ58/100)*$AW58/10,0)))","v":""},{"$f":"IF(OR($E59=\"\",$H59=\"\",$K59<=0,$AK58<=0,AY58=0),\"\",BY58/AY58)","v":""},{"$f":"IF(OR($E59=\"\",$H59=\"\",$K59<=0,$AK58<=0),\"\",($BY58*$K59)/100)","v":""}]
[null,null,null,{"$f":"IF(C59=\"Minerals\",\"i\",\"\")","v":""},null,null,null,null,null,{"$f":"IF(OR($C59=\"\",$E59=\"\",$H59=\"\"),\"\",VLOOKUP($H59,'Data source'!$B$128:$C$188,2,FALSE))","v":""},null,{"$f":"IF(OR(C59=\"\",E59=\"\",H59=\"\"),\"\",K59)","v":""},{"$f":"IF(AX58=0,\"\",AX58)","v":""},null,null,{"$f":"IF(OR(C59=\"\",E59=\"\",H59=\"\"),\"\",O59)","v":""},{"$f":"IF(AX59=0,\"\",AX59)","v":""},{"$f":"IF(OR(N60=\">3\",R60=\">3\"),\"i\",\"\")","v":""},null,null,null,null,"FAT",{"$f":"IF(Y12=\"No\",\"\",\"<6\")","v":""},null,null,{"$f":"IF($K$72>0,BL72,\"\")","v":""},{"$f":"IF(OR(X59=\"\",AA59=\"\"),\"\",IF(AA59>=6/0.9,\"i\",\"\"))","v":""},{"$f":"IF(AND($Q$35=\"YES\",$O$72>0),BL73,\"\")","v":""},{"$f":"IF(OR(X59=\"\",AC59=\"\"),\"\",IF(AC59>=6/0.9,\"i\",\"\"))","v":""},null,null,null,null,null,null,null,null,null,null,null,null,null,null,null,null,null,{"$f":"IF(OR(P59=\"\",$Q$35=\"NO\"),\"\",2)","v":""},{"$f":"IF(OR($E59=\"\",$H59=\"\",$O59<=0,$Q$35=\"NO\"),\"\",VLOOKUP($H59,'Data source'!$B$128:$C$188,2,FALSE))","v":""},{"$f":"IF(OR($E59=\"\",$H59=\"\",$O59<=0,$Q$35=\"NO\"),0,$O59*$AW59)","v":0},{"$f":"IF(OR($E59=\"\",$H59=\"\",$O59<=0,$Q$35=\"NO\"),\"\",VLOOKUP($E59,'Data source'!$B$4:$I$111,3,FALSE))","v":""},{"$f":"IF(OR($E59=\"\",$H59=\"\",$O59<=0,$Q$35=\"NO\"),\"\",VLOOKUP($E59,'Data source'!$B$4:$I$111,2,FALSE))","v":""},{"$f":"IF(OR($E59=\"\",$H59=\"\",$O59<=0,$Q$35=\"NO\"),\"\",$AX59*$AY59)","v":""},null,{"$f":"IF(OR($E59=\"\",$H59=\"\",$O59<=0,$Q$35=\"NO\"),\"\",VLOOKUP($E59,'Data source'!$B$4:$I$111,4,FALSE))","v":""},{"$f":"IF(OR($E59=\"\",$H59=\"\",$O59<=0,$Q$35=\"NO\"),\"\",(($AX59/$AX$73)*$BC59))","v":""},{"$f":"IF(OR($E59=\"\",$H59=\"\",$O59<=0,$Q$35=\"NO\"),\"\",VLOOKUP($E59,'Data source'!$B$4:$I$111,5,FALSE))","v":""},{"$f":"IF(OR($E59=\"\",$H59=\"\",$O59<=0,$Q$35=\"NO\"),\"\",(($AX59/$AX$73)*BE59))","v":""},{"$f":"IF(OR($E59=\"\",$H59=\"\",$O59<=0,$Q$35=\"NO\"),\"\",VLOOKUP($E59,'Data source'!$B$4:$I$111,6,FALSE))","v":""},{"$f":"IF(OR($E59=\"\",$H59=\"\",$O59<=0,$Q$35=\"NO\"),\"\",(($AX59/$AX$73)*BG59))","v":""},{"$f":"IF(OR($E59=\"\",$H59=\"\",$O59<=0,$Q$35=\"NO\"),\"\",VLOOKUP($E59,'Data source'!$B$4:$I$111,7,FALSE))","v":""},{"$f":"IF(OR($E59=\"\",$H59=\"\",$O59<=0,$Q$35=\"NO\"),\"\",(BI59/100*BH59)*($AX59/$AX$73))","v":""},{"$f":"IF(OR($E59=\"\",$H59=\"\",$O59<=0,$Q$35=\"NO\"),\"\",VLOOKUP($E59,'Data source'!$B$4:$I$111,8,FALSE))","v":""},{"$f":"IF(OR($E59=\"\",$H59=\"\",$O59<=0,$Q$35=\"NO\"),\"\",(($AX59/$AX$73)*BK59))","v":""},null,{"$f":"IF(OR($E59=\"\",$H59=\"\",$O59<=0,$Q$35=\"NO\"),0,VLOOKUP($E59,'Data source'!$B$4:$T$111,13,FALSE))","v":0},{"$f":"IF(OR($E59=\"\",$H59=\"\",$O59<=0,$Q$35=\"NO\"),0,VLOOKUP($E59,'Data source'!$B$4:$T$111,14,FALSE))","v":0},{"$f":"IF(OR($E59=\"\",$H59=\"\",$O59<=0,$Q$35=\"NO\"),0,VLOOKUP($E59,'Data source'!$B$4:$T$111,15,FALSE))","v":0},{"$f":"IF(OR($E59=\"\",$H59=\"\",$O59<=0,$Q$35=\"NO\"),0,VLOOKUP($E59,'Data source'!$B$4:$T$111,17,FALSE))","v":0},{"$f":"IF(OR($E59=\"\",$H59=\"\",$O59<=0,$Q$35=\"NO\"),0,VLOOKUP($E59,'Data source'!$B$4:$T$111,17,FALSE))","v":0},{"$f":"IF(OR($E59=\"\",$H59=\"\",$O59<=0,$Q$35=\"NO\"),0,VLOOKUP($E59,'Data source'!$B$4:$T$111,18,FALSE))","v":0},{"$f":"IF(OR($E59=\"\",$H59=\"\",$O59<=0,$Q$35=\"NO\"),0,VLOOKUP($E59,'Data source'!$B$4:$T$111,19,FALSE))","v":0},null,{"$f":"IF(OR($E59=\"\",$H59=\"\",$O59<=0,$Q$35=\"NO\"),0,((43.498*$BN59)+(25.574*$BO59))-((28.206*$BP59)+(62.375*$BQ59)))*$AX59*10/1000","v":0},null,{"$f":"IF(OR($E59=\"\",$H59=\"\",$O59<=0,$AK58<=0,$Q$35=\"NO\"),\"\",VLOOKUP($E59,'Data source'!$B$15:$M$104,12,FALSE))","v":""},{"$f":"IF(OR($E59=\"\",$H59=\"\",$O59<=0,$AK58<=0,$Q$35=\"NO\"),\"\",IF($BX59=\"Dry\",$AK58/$AW59/10,IF($BX59=\"Wet\",$AK58/($AZ59/100)*$AW59/10,0)))","v":""},{"$f":"IF(OR($E59=\"\",$H59=\"\",$O59<=0,$AK58<=0,AY59=0,$Q$35=\"NO\"),\"\",IF(OR($I47=\"-\",$AS59=\"-\",$O59=0),\"\",BY59/AY59))","v":""},{"$f":"IF(OR($E59=\"\",$H59=\"\",$O59<=0,$AK58<=0,$Q$35=\"NO\"),\"\",IF(OR($I47=\"-\",$AS59=\"-\",$O59=0),\"\",($BY59*$O59)/100))","v":""}]
[null,null,null,null,null,null,null,null,null,null,null,null,null,{"$f":"IF(OR($H$7=\"Dry\", K59=\"\"),\"\",IF(AND(E59=\"PKE\",K59>3),\">3\",\"\"))","v":""},null,null,null,{"$f":"IF(OR($H$7=\"Dry\", O59=\"\"),\"\",IF(AND(E59=\"PKE\",O59>3),\">3\",\"\"))","v":""},null,null,null,null,null,null,null,null,null,null,null,null,null,null,null,null,null,null,null,{"$f":"IF(OR($E60=\"-\",$H60=\"-\",$O61<=0,$AK59<=0,$Q$35=\"NO\"),\"\",IF(OR(#REF!=\"-\",$AS60=\"-\",$O61=0),\"\",($BY60*$O61)/100))","v":""}]
[null,null,null,null,null,null,null,null,null,null,null,null,null,null,null,null,null,null,null,null,null,null,null,null,null,null,null,null,null,null,null,{"$f":"IF($C62=\"Hay_Silage\",\"FT1_\",IF($C62=\"Concentrates\",\"FT2_\",IF($C62=\"By_products\",\"FT3_\",IF($C62=\"Fodder_beet_Default\",\"FT4_\",IF($C62=\"Other_Crops_Default\",\"FT5_\",IF($C62=\"Minerals\",\"FT6_\",IF($C62=\"Custom_Feeds_Minerals\",\"FT7_\",IF($C62=\"Custom_Bulb_Crops\",\"FT8_\",\"-\"))))))))","v":"-"},null,null,null,null,null,{"$f":"IF(OR($E62=\"\",$H62=\"\"),\"\",IF(AY61=\"\",IF(AY62>0,BZ62,0),BZ61))","v":""},null,{"$f":"IF(OR($E62=\"\",$H62=\"\",$K62=\"\",$O$6=\"\"),\"\",($K62/1000)*$O$6)","v":""},{"$f":"CA61","v":""},null,{"$f":"IF(OR($E62=\"\",$H62=\"\",$O62=\"\",$O$6=\"\"),\"\",($O62/1000)*$O$6)","v":""},{"$f":"CA62","v":""},null,null,{"$f":"IF(E62=\"\",\"\",E62)","v":""},{"$f":"IF(L62=\"\",\"\",1)","v":""},{"$f":"IF(OR($E62=\"\",$H62=\"\",$K62<=0),\"\",VLOOKUP($H62,'Data source'!$B$128:$C$188,2,FALSE))","v":""},{"$f":"IF(OR($E62=\"\",$H62=\"\",$K62<=0),0,K62*AW61)","v":0},{"$f":"IF(OR($E62=\"\",$H62=\"\",$K62=0),\"\",VLOOKUP($E62,'Data source'!$B$4:$I$111,3,FALSE))","v":""},{"$f":"IF(OR($E62=\"\",$H62=\"\",$K62=0),\"\",VLOOKUP($E62,'Data source'!$B$4:$I$111,2,FALSE))","v":""},{"$f":"IF(OR($E62=\"\",$H62=\"\",$K62<=0),\"\",AX61*AY61)","v":""},null,{"$f":"IF(OR($E62=\"\",$H62=\"\",$K62=0),\"\",VLOOKUP($E62,'Data source'!$B$4:$I$111,4,FALSE))","v":""},{"$f":"IF(OR($E62=\"\",$H62=\"\",$K62<=0),\"\",(($AX61/$AX$72)*BC61))","v":""},{"$f":"IF(OR($E62=\"\",$H62=\"\",$K62=0),\"\",VLOOKUP($E62,'Data source'!$B$4:$I$111,5,FALSE))","v":""},{"$f":"IF(OR($E62=\"\",$H62=\"\",$K62<=0),\"\",(($AX61/$AX$72)*BE61))","v":""},{"$f":"IF(OR($E62=\"\",$H62=\"\",$K62=0),\"\",VLOOKUP($E62,'Data source'!$B$4:$I$111,6,FALSE))","v":""},{"$f":"IF(OR($E62=\"\",$H62=\"\",$K62<=0),\"\",(($AX61/$AX$72)*BG61))","v":""},{"$f":"IF(OR($E62=\"\",$H62=\"\",$K62=0),\"\",VLOOKUP($E62,'Data source'!$B$4:$I$111,7,FALSE))","v":""},{"$f":"IF(OR($E62=\"\",$H62=\"\",$K62<=0),\"\",(BI61/100*BH61)*($AX61/$AX$72))","v":""},{"$f":"IF(OR($E62=\"\",$H62=\"\",$K62=0),\"\",VLOOKUP($E62,'Data source'!$B$4:$I$111,8,FALSE))","v":""},{"$f":"IF(OR($E62=\"\",$H62=\"\",$K62<=0),\"\",(($AX61/$AX$72)*BK61))","v":""},null,{"$f":"IF(OR($E62=\"\",$H62=\"\",$K62=0),0,VLOOKUP($E62,'Data source'!$B$4:$T$111,13,FALSE))","v":0},{"$f":"IF(OR($E62=\"\",$H62=\"\",$K62=0),0,VLOOKUP($E62,'Data source'!$B$4:$T$111,14,FALSE))","v":0},{"$f":"IF(OR($E62=\"\",$H62=\"\",$K62=0),0,VLOOKUP($E62,'Data source'!$B$4:$T$111,15,FALSE))","v":0},{"$f":"IF(OR($E62=\"\",$H62=\"\",$K62=0),0,VLOOKUP($E62,'Data source'!$B$4:$T$111,16,FALSE))","v":0},{"$f":"IF(OR($E62=\"\",$H62=\"\",$K62=0),0,VLOOKUP($E62,'Data source'!$B$4:$T$111,17,FALSE))","v":0},{"$f":"IF(OR($E62=\"\",$H62=\"\",$K62=0),0,VLOOKUP($E62,'Data source'!$B$4:$T$111,18,FALSE))","v":0},{"$f":"IF(OR($E62=\"\",$H62=\"\",$K62=0),0,VLOOKUP($E62,'Data source'!$B$4:$T$111,19,FALSE))","v":0},null,{"$f":"IF(OR($E62=\"\",$H62=\"\",$K62<=0),0,((43.498*$BN61)+(25.574*$BO61))-((28.206*$BP61)+(62.375*$BQ61)))*$AX61*10/1000","v":0},null,{"$f":"IF(OR($E62=\"\",$H62=\"\",$K62<=0,$AK61<=0),\"\",VLOOKUP($E62,'Data source'!$B$15:$M$104,12,FALSE))","v":""},{"$f":"IF(OR($E62=\"\",$H62=\"\",$K62<=0,$AK61<=0),\"\",IF($BX61=\"Dry\",$AK61/$AW61/10,IF($BX61=\"Wet\",$AK61/($AZ61/100)*$AW61/10,0)))","v":""},{"$f":"IF(OR($E62=\"\",$H62=\"\",$K62<=0,$AK61<=0,AY61),\"\",BY61/AY61)","v":""},{"$f":"IF(OR($E62=\"\",$H62=\"\",$K62<=0,$AK61<=0),\"\",($BY61*$K62)/100)","v":""}]
[null,null,null,{"$f":"IF(C62=\"Minerals\",\"i\",\"\")","v":""},null,null,null,null,null,{"$f":"IF(OR($C62=\"\",$E62=\"\",$H62=\"\"),\"\",VLOOKUP($H62,'Data source'!$B$128:$C$188,2,FALSE))","v":""},null,{"$f":"IF(OR(C62=\"\",E62=\"\",H62=\"\"),\"\",K62)","v":""},{"$f":"IF(AX61=0,\"\",AX61)","v":""},null,null,{"$f":"IF(OR(C62=\"\",E62=\"\",H62=\"\"),\"\",O62)","v":""},{"$f":"IF(AX62=0,\"\",AX62)","v":""},{"$f":"IF(OR(N63=\">3\",R63=\">3\"),\"i\",\"\")","v":""},null,null,null,null,null,null,null,null,null,null,null,null,null,null,null,null,null,null,null,null,null,null,null,null,null,null,null,null,null,{"$f":"IF(OR(P62=\"\",$Q$35=\"NO\"),\"\",2)","v":""},{"$f":"IF(OR($E62=\"\",$H62=\"\",$O62<=0,$Q$35=\"NO\"),\"\",VLOOKUP($H62,'Data source'!$B$128:$C$188,2,FALSE))","v":""},{"$f":"IF(OR($E62=\"\",$H62=\"\",$O62<=0,$Q$35=\"NO\"),0,$O62*$AW62)","v":0},{"$f":"IF(OR($E62=\"\",$H62=\"\",$O62<=0,$Q$35=\"NO\"),\"\",VLOOKUP($E62,'Data source'!$B$4:$I$111,3,FALSE))","v":""},{"$f":"IF(OR($E62=\"\",$H62=\"\",$O62<=0,$Q$35=\"NO\"),\"\",VLOOKUP($E62,'Data source'!$B$4:$I$111,2,FALSE))","v":""},{"$f":"IF(OR($E62=\"\",$H62=\"\",$O62<=0,$Q$35=\"NO\"),\"\",$AX62*$AY62)","v":""},null,{"$f":"IF(OR($E62=\"\",$H62=\"\",$O62<=0,$Q$35=\"NO\"),\"\",VLOOKUP($E62,'Data source'!$B$4:$I$111,4,FALSE))","v":""},{"$f":"IF(OR($E62=\"\",$H62=\"\",$O62<=0,$Q$35=\"NO\"),\"\",(($AX62/$AX$73)*$BC62))","v":""},{"$f":"IF(OR($E62=\"\",$H62=\"\",$O62<=0,$Q$35=\"NO\"),\"\",VLOOKUP($E62,'Data source'!$B$4:$I$111,5,FALSE))","v":""},{"$f":"IF(OR($E62=\"\",$H62=\"\",$O62<=0,$Q$35=\"NO\"),\"\",(($AX62/$AX$73)*BE62))","v":""},{"$f":"IF(OR($E62=\"\",$H62=\"\",$O62<=0,$Q$35=\"NO\"),\"\",VLOOKUP($E62,'Data source'!$B$4:$I$111,6,FALSE))","v":""},{"$f":"IF(OR($E62=\"\",$H62=\"\",$O62<=0,$Q$35=\"NO\"),\"\",(($AX62/$AX$73)*BG62))","v":""},{"$f":"IF(OR($E62=\"\",$H62=\"\",$O62<=0,$Q$35=\"NO\"),\"\",VLOOKUP($E62,'Data source'!$B$4:$I$111,7,FALSE))","v":""},{"$f":"IF(OR($E62=\"\",$H62=\"\",$O62<=0,$Q$35=\"NO\"),\"\",(BI62/100*BH62)*($AX62/$AX$73))","v":""},{"$f":"IF(OR($E62=\"\",$H62=\"\",$O62<=0,$Q$35=\"NO\"),\"\",VLOOKUP($E62,'Data source'!$B$4:$I$111,8,FALSE))","v":""},{"$f":"IF(OR($E62=\"\",$H62=\"\",$O62<=0,$Q$35=\"NO\"),\"\",(($AX62/$AX$73)*BK62))","v":""},null,{"$f":"IF(OR($E62=\"\",$H62=\"\",$O62<=0,$Q$35=\"NO\"),0,VLOOKUP($E62,'Data source'!$B$4:$T$111,13,FALSE))","v":0},{"$f":"IF(OR($E62=\"\",$H62=\"\",$O62<=0,$Q$35=\"NO\"),0,VLOOKUP($E62,'Data source'!$B$4:$T$111,14,FALSE))","v":0},{"$f":"IF(OR($E62=\"\",$H62=\"\",$O62<=0,$Q$35=\"NO\"),0,VLOOKUP($E62,'Data source'!$B$4:$T$111,15,FALSE))","v":0},{"$f":"IF(OR($E62=\"\",$H62=\"\",$O62<=0,$Q$35=\"NO\"),0,VLOOKUP($E62,'Data source'!$B$4:$T$111,17,FALSE))","v":0},{"$f":"IF(OR($E62=\"\",$H62=\"\",$O62<=0,$Q$35=\"NO\"),0,VLOOKUP($E62,'Data source'!$B$4:$T$111,17,FALSE))","v":0},{"$f":"IF(OR($E62=\"\",$H62=\"\",$O62<=0,$Q$35=\"NO\"),0,VLOOKUP($E62,'Data source'!$B$4:$T$111,18,FALSE))","v":0},{"$f":"IF(OR($E62=\"\",$H62=\"\",$O62<=0,$Q$35=\"NO\"),0,VLOOKUP($E62,'Data source'!$B$4:$T$111,19,FALSE))","v":0},null,{"$f":"IF(OR($E62=\"\",$H62=\"\",$O62<=0,$Q$35=\"NO\"),0,((43.498*$BN62)+(25.574*$BO62))-((28.206*$BP62)+(62.375*$BQ62)))*$AX62*10/1000","v":0},null,{"$f":"IF(OR($E62=\"\",$H62=\"\",$O62<=0,$AK61<=0,$Q$35=\"NO\"),\"\",VLOOKUP($E62,'Data source'!$B$15:$M$104,12,FALSE))","v":""},{"$f":"IF(OR($E62=\"\",$H62=\"\",$O62<=0,$AK61<=0,$Q$35=\"NO\"),\"\",IF($BX62=\"Dry\",$AK61/$AW62/10,IF($BX62=\"Wet\",$AK61/($AZ62/100)*$AW62/10,0)))","v":""},{"$f":"IF(OR($E62=\"\",$H62=\"\",$O62<=0,$AK61<=0,AY62=0,$Q$35=\"NO\"),\"\",IF(OR($I50=\"-\",$AS62=\"-\",$O62=0),\"\",BY62/AY62))","v":""},{"$f":"IF(OR($E62=\"\",$H62=\"\",$O62<=0,$AK61<=0,$Q$35=\"NO\"),\"\",IF(OR($I50=\"-\",$AS62=\"-\",$O62=0),\"\",($BY62*$O62)/100))","v":""}]
[null,null,null,null,null,null,null,null,null,null,null,null,null,{"$f":"IF(OR($H$7=\"Dry\", K62=\"\"),\"\",IF(AND(E62=\"PKE\",K62>3),\">3\",\"\"))","v":""},null,null,null,{"$f":"IF(OR($H$7=\"Dry\", O62=\"\"),\"\",IF(AND(E62=\"PKE\",O62>3),\">3\",\"\"))","v":""},null,null,null,null,null,null,null,null,null,null,null,null,null,null,null,null,null,null,null,{"$f":"IF(OR($E63=\"-\",$H63=\"-\",$O64<=0,$AK62<=0,$Q$35=\"NO\"),\"\",IF(OR($I40=\"-\",$AS63=\"-\",$O64=0),\"\",($BY63*$O64)/100))","v":""}]
[null,null,null,null,null,null,null,null,null,null,null,null,null,null,null,null,null,null,null,null,null,null,"MINERALS",null,null,null,null,null,null,null,null,{"$f":"IF($C65=\"Hay_Silage\",\"FT1_\",IF($C65=\"Concentrates\",\"FT2_\",IF($C65=\"By_products\",\"FT3_\",IF($C65=\"Fodder_beet_Default\",\"FT4_\",IF($C65=\"Other_Crops_Default\",\"FT5_\",IF($C65=\"Minerals\",\"FT6_\",IF($C65=\"Custom_Feeds_Minerals\",\"FT7_\",IF($C65=\"Custom_Bulb_Crops\",\"FT8_\",\"-\"))))))))","v":"-"},null,null,null,null,null,{"$f":"IF(OR($E65=\"\",$H65=\"\"),\"\",IF(AY64=\"\",IF(AY65>0,BZ65,0),BZ64))","v":""},null,{"$f":"IF(OR($E65=\"\",$H65=\"\",$K65=\"\",$O$6=\"\"),\"\",($K65/1000)*$O$6)","v":""},{"$f":"CA64","v":""},null,{"$f":"IF(OR($E65=\"\",$H65=\"\",$O65=\"\",$O$6=\"\"),\"\",($O65/1000)*$O$6)","v":""},{"$f":"CA65","v":""},null,null,{"$f":"IF(E65=\"\",\"\",E65)","v":""},{"$f":"IF(L65=\"\",\"\",1)","v":""},{"$f":"IF(OR($E65=\"\",$H65=\"\",$K65<=0),\"\",VLOOKUP($H65,'Data source'!$B$128:$C$188,2,FALSE))","v":""},{"$f":"IF(OR($E65=\"\",$H65=\"\",$K65<=0),0,K65*AW64)","v":0},{"$f":"IF(OR($E65=\"\",$H65=\"\",$K65=0),\"\",VLOOKUP($E65,'Data source'!$B$4:$I$111,3,FALSE))","v":""},{"$f":"IF(OR($E65=\"\",$H65=\"\",$K65=0),\"\",VLOOKUP($E65,'Data source'!$B$4:$I$111,2,FALSE))","v":""},{"$f":"IF(OR($E65=\"\",$H65=\"\",$K65<=0),\"\",AX64*AY64)","v":""},null,{"$f":"IF(OR($E65=\"\",$H65=\"\",$K65=0),\"\",VLOOKUP($E65,'Data source'!$B$4:$I$111,4,FALSE))","v":""},{"$f":"IF(OR($E65=\"\",$H65=\"\",$K65<=0),\"\",(($AX64/$AX$72)*BC64))","v":""},{"$f":"IF(OR($E65=\"\",$H65=\"\",$K65=0),\"\",VLOOKUP($E65,'Data source'!$B$4:$I$111,5,FALSE))","v":""},{"$f":"IF(OR($E65=\"\",$H65=\"\",$K65<=0),\"\",(($AX64/$AX$72)*BE64))","v":""},{"$f":"IF(OR($E65=\"\",$H65=\"\",$K65=0),\"\",VLOOKUP($E65,'Data source'!$B$4:$I$111,6,FALSE))","v":""},{"$f":"IF(OR($E65=\"\",$H65=\"\",$K65<=0),\"\",(($AX64/$AX$72)*BG64))","v":""},{"$f":"IF(OR($E65=\"\",$H65=\"\",$K65=0),\"\",VLOOKUP($E65,'Data source'!$B$4:$I$111,7,FALSE))","v":""},{"$f":"IF(OR($E65=\"\",$H65=\"\",$K65<=0),\"\",(BI64/100*BH64)*($AX64/$AX$72))","v":""},{"$f":"IF(OR($E65=\"\",$H65=\"\",$K65=0),\"\",VLOOKUP($E65,'Data source'!$B$4:$I$111,8,FALSE))","v":""},{"$f":"IF(OR($E65=\"\",$H65=\"\",$K65<=0),\"\",(($AX64/$AX$72)*BK64))","v":""},null,{"$f":"IF(OR($E65=\"\",$H65=\"\",$K65=0),0,VLOOKUP($E65,'Data source'!$B$4:$T$111,13,FALSE))","v":0},{"$f":"IF(OR($E65=\"\",$H65=\"\",$K65=0),0,VLOOKUP($E65,'Data source'!$B$4:$T$111,14,FALSE))","v":0},{"$f":"IF(OR($E65=\"\",$H65=\"\",$K65=0),0,VLOOKUP($E65,'Data source'!$B$4:$T$111,15,FALSE))","v":0},{"$f":"IF(OR($E65=\"\",$H65=\"\",$K65=0),0,VLOOKUP($E65,'Data source'!$B$4:$T$111,16,FALSE))","v":0},{"$f":"IF(OR($E65=\"\",$H65=\"\",$K65=0),0,VLOOKUP($E65,'Data source'!$B$4:$T$111,17,FALSE))","v":0},{"$f":"IF(OR($E65=\"\",$H65=\"\",$K65=0),0,VLOOKUP($E65,'Data source'!$B$4:$T$111,18,FALSE))","v":0},{"$f":"IF(OR($E65=\"\",$H65=\"\",$K65=0),0,VLOOKUP($E65,'Data source'!$B$4:$T$111,19,FALSE))","v":0},null,{"$f":"IF(OR($E65=\"\",$H65=\"\",$K65<=0),0,((43.498*$BN64)+(25.574*$BO64))-((28.206*$BP64)+(62.375*$BQ64)))*$AX64*10/1000","v":0},null,{"$f":"IF(OR($E65=\"\",$H65=\"\",$K65<=0,$AK64<=0),\"\",VLOOKUP($E65,'Data source'!$B$15:$M$104,12,FALSE))","v":""},{"$f":"IF(OR($E65=\"\",$H65=\"\",$K65<=0,$AK64<=0),\"\",IF($BX64=\"Dry\",$AK64/$AW64/10,IF($BX64=\"Wet\",$AK64/($AZ64/100)*$AW64/10,0)))","v":""},{"$f":"IF(OR($E65=\"\",$H65=\"\",$K65<=0,$AK64<=0,AY64=0),\"\",BY64/AY64)","v":""},{"$f":"IF(OR($E65=\"\",$H65=\"\",$K65<=0,$AK64<=0),\"\",($BY64*$K65)/100)","v":""}]
[null,null,null,{"$f":"IF(C65=\"Minerals\",\"i\",\"\")","v":""},null,null,null,null,null,{"$f":"IF(OR($C65=\"\",$E65=\"\",$H65=\"\"),\"\",VLOOKUP($H65,'Data source'!$B$128:$C$188,2,FALSE))","v":""},null,{"$f":"IF(OR(C65=\"\",E65=\"\",H65=\"\"),\"\",K65)","v":""},{"$f":"IF(AX64=0,\"\",AX64)","v":""},null,null,{"$f":"IF(OR(C65=\"\",E65=\"\",H65=\"\"),\"\",O65)","v":""},{"$f":"IF(AX65=0,\"\",AX65)","v":""},{"$f":"IF(OR(N66=\">3\",R66=\">3\"),\"i\",\"\")","v":""},null,null,null,null,"Na",{"$f":"IF(Y12=\"No\",\"\",IF($H$7=\"Early\",0.2,IF($H$7=\"Mid\",0.2,IF($H$7=\"Late\",0.2,IF($H$7=\"Dry\",IF(AF16=\"YES\",0.12,0.15))))))","v":""},"min",null,{"$f":"IF($K$72>0,BN72,\"\")","v":""},null,{"$f":"IF(AND($Q$35=\"YES\",$O$72>0),BN73,\"\")","v":""},null,null,null,null,null,null,null,null,null,null,null,null,null,null,null,null,null,null,{"$f":"IF(OR(P65=\"\",$Q$35=\"NO\"),\"\",2)","v":""},{"$f":"IF(OR($E65=\"\",$H65=\"\",$O65<=0,$Q$35=\"NO\"),\"\",VLOOKUP($H65,'Data source'!$B$128:$C$188,2,FALSE))","v":""},{"$f":"IF(OR($E65=\"\",$H65=\"\",$O65<=0,$Q$35=\"NO\"),0,$O65*$AW65)","v":0},{"$f":"IF(OR($E65=\"\",$H65=\"\",$O65<=0,$Q$35=\"NO\"),\"\",VLOOKUP($E65,'Data source'!$B$4:$I$111,3,FALSE))","v":""},{"$f":"IF(OR($E65=\"\",$H65=\"\",$O65<=0,$Q$35=\"NO\"),\"\",VLOOKUP($E65,'Data source'!$B$4:$I$111,2,FALSE))","v":""},{"$f":"IF(OR($E65=\"\",$H65=\"\",$O65<=0,$Q$35=\"NO\"),\"\",$AX65*$AY65)","v":""},null,{"$f":"IF(OR($E65=\"\",$H65=\"\",$O65<=0,$Q$35=\"NO\"),\"\",VLOOKUP($E65,'Data source'!$B$4:$I$111,4,FALSE))","v":""},{"$f":"IF(OR($E65=\"\",$H65=\"\",$O65<=0,$Q$35=\"NO\"),\"\",(($AX65/$AX$73)*$BC65))","v":""},{"$f":"IF(OR($E65=\"\",$H65=\"\",$O65<=0,$Q$35=\"NO\"),\"\",VLOOKUP($E65,'Data source'!$B$4:$I$111,5,FALSE))","v":""},{"$f":"IF(OR($E65=\"\",$H65=\"\",$O65<=0,$Q$35=\"NO\"),\"\",(($AX65/$AX$73)*BE65))","v":""},{"$f":"IF(OR($E65=\"\",$H65=\"\",$O65<=0,$Q$35=\"NO\"),\"\",VLOOKUP($E65,'Data source'!$B$4:$I$111,6,FALSE))","v":""},{"$f":"IF(OR($E65=\"\",$H65=\"\",$O65<=0,$Q$35=\"NO\"),\"\",(($AX65/$AX$73)*BG65))","v":""},{"$f":"IF(OR($E65=\"\",$H65=\"\",$O65<=0,$Q$35=\"NO\"),\"\",VLOOKUP($E65,'Data source'!$B$4:$I$111,7,FALSE))","v":""},{"$f":"IF(OR($E65=\"\",$H65=\"\",$O65<=0,$Q$35=\"NO\"),\"\",(BI65/100*BH65)*($AX65/$AX$73))","v":""},{"$f":"IF(OR($E65=\"\",$H65=\"\",$O65<=0,$Q$35=\"NO\"),\"\",VLOOKUP($E65,'Data source'!$B$4:$I$111,8,FALSE))","v":""},{"$f":"IF(OR($E65=\"\",$H65=\"\",$O65<=0,$Q$35=\"NO\"),\"\",(($AX65/$AX$73)*BK65))","v":""},null,{"$f":"IF(OR($E65=\"\",$H65=\"\",$O65<=0,$Q$35=\"NO\"),0,VLOOKUP($E65,'Data source'!$B$4:$T$111,13,FALSE))","v":0},{"$f":"IF(OR($E65=\"\",$H65=\"\",$O65<=0,$Q$35=\"NO\"),0,VLOOKUP($E65,'Data source'!$B$4:$T$111,14,FALSE))","v":0},{"$f":"IF(OR($E65=\"\",$H65=\"\",$O65<=0,$Q$35=\"NO\"),0,VLOOKUP($E65,'Data source'!$B$4:$T$111,15,FALSE))","v":0},{"$f":"IF(OR($E65=\"\",$H65=\"\",$O65<=0,$Q$35=\"NO\"),0,VLOOKUP($E65,'Data source'!$B$4:$T$111,17,FALSE))","v":0},{"$f":"IF(OR($E65=\"\",$H65=\"\",$O65<=0,$Q$35=\"NO\"),0,VLOOKUP($E65,'Data source'!$B$4:$T$111,17,FALSE))","v":0},{"$f":"IF(OR($E65=\"\",$H65=\"\",$O65<=0,$Q$35=\"NO\"),0,VLOOKUP($E65,'Data source'!$B$4:$T$111,18,FALSE))","v":0},{"$f":"IF(OR($E65=\"\",$H65=\"\",$O65<=0,$Q$35=\"NO\"),0,VLOOKUP($E65,'Data source'!$B$4:$T$111,19,FALSE))","v":0},null,{"$f":"IF(OR($E65=\"\",$H65=\"\",$O65<=0,$Q$35=\"NO\"),0,((43.498*$BN65)+(25.574*$BO65))-((28.206*$BP65)+(62.375*$BQ65)))*$AX65*10/1000","v":0},null,{"$f":"IF(OR($E65=\"\",$H65=\"\",$O65<=0,$AK64<=0,$Q$35=\"NO\"),\"\",VLOOKUP($E65,'Data source'!$B$15:$M$104,12,FALSE))","v":""},{"$f":"IF(OR($E65=\"\",$H65=\"\",$O65<=0,$AK64<=0,$Q$35=\"NO\"),\"\",IF($BX65=\"Dry\",$AK64/$AW65/10,IF($BX65=\"Wet\",$AK64/($AZ65/100)*$AW65/10,0)))","v":""},{"$f":"IF(OR($E65=\"\",$H65=\"\",$O65<=0,$AK64<=0,AY65=0,$Q$35=\"NO\"),\"\",IF(OR($I53=\"-\",$AS65=\"-\",$O65=0),\"\",BY65/AY65))","v":""},{"$f":"IF(OR($E65=\"\",$H65=\"\",$O65<=0,$AK64<=0,$Q$35=\"NO\"),\"\",IF(OR($I53=\"-\",$AS65=\"-\",$O65=0),\"\",($BY65*$O65)/100))","v":""}]
[null,null,null,null,null,null,null,null,null,null,null,null,null,{"$f":"IF(OR($H$7=\"Dry\", K65=\"\"),\"\",IF(AND(E65=\"PKE\",K65>3),\">3\",\"\"))","v":""},null,null,null,{"$f":"IF(OR($H$7=\"Dry\", O65=\"\"),\"\",IF(AND(E65=\"PKE\",O65>3),\">3\",\"\"))","v":""},null,null,null,null,null,null,null,null,null,null,null,null,null,null,null,null,null,null,null,{"$f":"IF(OR($E66=\"-\",$H66=\"-\",$O67<=0,$AK65<=0,$Q$35=\"NO\"),\"\",IF(OR($I43=\"-\",$AS66=\"-\",$O67=0),\"\",($BY66*$O67)/100))","v":""}]
[null,null,null,null,null,null,null,null,null,null,null,null,null,null,null,null,null,null,null,null,null,null,null,null,null,null,null,null,null,null,null,{"$f":"IF($C68=\"Hay_Silage\",\"FT1_\",IF($C68=\"Concentrates\",\"FT2_\",IF($C68=\"By_products\",\"FT3_\",IF($C68=\"Fodder_beet_Default\",\"FT4_\",IF($C68=\"Other_Crops_Default\",\"FT5_\",IF($C68=\"Minerals\",\"FT6_\",IF($C68=\"Custom_Feeds_Minerals\",\"FT7_\",IF($C68=\"Custom_Bulb_Crops\",\"FT8_\",\"-\"))))))))","v":"-"},null,null,null,null,null,{"$f":"IF(OR($E68=\"\",$H68=\"\"),\"\",IF(AY67=\"\",IF(AY68>0,BZ68,0),BZ67))","v":""},null,{"$f":"IF(OR($E68=\"\",$H68=\"\",$K68=\"\",$O$6=\"\"),\"\",($K68/1000)*$O$6)","v":""},{"$f":"CA67","v":""},null,{"$f":"IF(OR($E68=\"\",$H68=\"\",$O68=\"\",$O$6=\"\"),\"\",($O68/1000)*$O$6)","v":""},{"$f":"CA68","v":""},null,null,{"$f":"IF(E68=\"\",\"\",E68)","v":""},{"$f":"IF(L68=\"\",\"\",1)","v":""},{"$f":"IF(OR($E68=\"\",$H68=\"\",$K68<=0),\"\",VLOOKUP($H68,'Data source'!$B$128:$C$188,2,FALSE))","v":""},{"$f":"IF(OR($E68=\"\",$H68=\"\",$K68<=0),0,K68*AW67)","v":0},{"$f":"IF(OR($E68=\"\",$H68=\"\",$K68=0),\"\",VLOOKUP($E68,'Data source'!$B$4:$I$111,3,FALSE))","v":""},{"$f":"IF(OR($E68=\"\",$H68=\"\",$K68=0),\"\",VLOOKUP($E68,'Data source'!$B$4:$I$111,2,FALSE))","v":""},{"$f":"IF(OR($E68=\"\",$H68=\"\",$K68<=0),\"\",AX67*AY67)","v":""},null,{"$f":"IF(OR($E68=\"\",$H68=\"\",$K68=0),\"\",VLOOKUP($E68,'Data source'!$B$4:$I$111,4,FALSE))","v":""},{"$f":"IF(OR($E68=\"\",$H68=\"\",$K68<=0),\"\",(($AX67/$AX$72)*BC67))","v":""},{"$f":"IF(OR($E68=\"\",$H68=\"\",$K68=0),\"\",VLOOKUP($E68,'Data source'!$B$4:$I$111,5,FALSE))","v":""},{"$f":"IF(OR($E68=\"\",$H68=\"\",$K68<=0),\"\",(($AX67/$AX$72)*BE67))","v":""},{"$f":"IF(OR($E68=\"\",$H68=\"\",$K68=0),\"\",VLOOKUP($E68,'Data source'!$B$4:$I$111,6,FALSE))","v":""},{"$f":"IF(OR($E68=\"\",$H68=\"\",$K68<=0),\"\",(($AX67/$AX$72)*BG67))","v":""},{"$f":"IF(OR($E68=\"\",$H68=\"\",$K68=0),\"\",VLOOKUP($E68,'Data source'!$B$4:$I$111,7,FALSE))","v":""},{"$f":"IF(OR($E68=\"\",$H68=\"\",$K68<=0),\"\",(BI67/100*BH67)*($AX67/$AX$72))","v":""},{"$f":"IF(OR($E68=\"\",$H68=\"\",$K68=0),\"\",VLOOKUP($E68,'Data source'!$B$4:$I$111,8,FALSE))","v":""},{"$f":"IF(OR($E68=\"\",$H68=\"\",$K68<=0),\"\",(($AX67/$AX$72)*BK67))","v":""},null,{"$f":"IF(OR($E68=\"\",$H68=\"\",$K68=0),0,VLOOKUP($E68,'Data source'!$B$4:$T$111,13,FALSE))","v":0},{"$f":"IF(OR($E68=\"\",$H68=\"\",$K68=0),0,VLOOKUP($E68,'Data source'!$B$4:$T$111,14,FALSE))","v":0},{"$f":"IF(OR($E68=\"\",$H68=\"\",$K68=0),0,VLOOKUP($E68,'Data source'!$B$4:$T$111,15,FALSE))","v":0},{"$f":"IF(OR($E68=\"\",$H68=\"\",$K68=0),0,VLOOKUP($E68,'Data source'!$B$4:$T$111,16,FALSE))","v":0},{"$f":"IF(OR($E68=\"\",$H68=\"\",$K68=0),0,VLOOKUP($E68,'Data source'!$B$4:$T$111,17,FALSE))","v":0},{"$f":"IF(OR($E68=\"\",$H68=\"\",$K68=0),0,VLOOKUP($E68,'Data source'!$B$4:$T$111,18,FALSE))","v":0},{"$f":"IF(OR($E68=\"\",$H68=\"\",$K68=0),0,VLOOKUP($E68,'Data source'!$B$4:$T$111,19,FALSE))","v":0},null,{"$f":"IF(OR($E68=\"\",$H68=\"\",$K68<=0),0,((43.498*$BN67)+(25.574*$BO67))-((28.206*$BP67)+(62.375*$BQ67)))*$AX67*10/1000","v":0},null,{"$f":"IF(OR($E68=\"\",$H68=\"\",$K68<=0,$AK67<=0),\"\",VLOOKUP($E68,'Data source'!$B$15:$M$104,12,FALSE))","v":""},{"$f":"IF(OR($E68=\"\",$H68=\"\",$K68<=0,$AK67<=0),\"\",IF($BX67=\"Dry\",$AK67/$AW67/10,IF($BX67=\"Wet\",$AK67/($AZ67/100)*$AW67/10,0)))","v":""},{"$f":"IF(OR($E68=\"\",$H68=\"\",$K68<=0,$AK67<=0,AY72=0),\"\",BY67/AY67)","v":""},{"$f":"IF(OR($E68=\"\",$H68=\"\",$K68<=0,$AK67<=0),\"\",($BY67*$K68)/100)","v":""}]
[null,null,null,{"$f":"IF(C68=\"Minerals\",\"i\",\"\")","v":""},null,null,null,null,null,{"$f":"IF(OR($C68=\"\",$E68=\"\",$H68=\"\"),\"\",VLOOKUP($H68,'Data source'!$B$128:$C$188,2,FALSE))","v":""},null,{"$f":"IF(OR(C68=\"\",E68=\"\",H68=\"\"),\"\",K68)","v":""},{"$f":"IF(AX67=0,\"\",AX67)","v":""},null,null,{"$f":"IF(OR(C68=\"\",E68=\"\",H68=\"\"),\"\",O68)","v":""},{"$f":"IF(AX68=0,\"\",AX68)","v":""},{"$f":"IF(OR(N69=\">3\",R69=\">3\"),\"i\",\"\")","v":""},null,null,null,null,"K",{"$f":"IF(Y12=\"No\",\"\",IF($H$7=\"early\",1.2,IF($H$7=\"mid\",1.2,IF($H$7=\"late\",1.2,IF($H$7=\"dry\",IF(AF16=\"YES\",1.2,1.2))))))","v":""},"min",null,{"$f":"IF($K$72>0,BO72,\"\")","v":""},null,{"$f":"IF(AND($Q$35=\"YES\",$O$72>0),BO73,\"\")","v":""},null,null,null,null,null,null,null,null,null,null,null,null,null,null,null,null,null,null,{"$f":"IF(OR(P68=\"\",$Q$35=\"NO\"),\"\",2)","v":""},{"$f":"IF(OR($E68=\"\",$H68=\"\",$O68<=0,$Q$35=\"NO\"),\"\",VLOOKUP($H68,'Data source'!$B$128:$C$188,2,FALSE))","v":""},{"$f":"IF(OR($E68=\"\",$H68=\"\",$O68<=0,$Q$35=\"NO\"),0,$O68*$AW68)","v":0},{"$f":"IF(OR($E68=\"\",$H68=\"\",$O68<=0,$Q$35=\"NO\"),\"\",VLOOKUP($E68,'Data source'!$B$4:$I$111,3,FALSE))","v":""},{"$f":"IF(OR($E68=\"\",$H68=\"\",$O68<=0,$Q$35=\"NO\"),\"\",VLOOKUP($E68,'Data source'!$B$4:$I$111,2,FALSE))","v":""},{"$f":"IF(OR($E68=\"\",$H68=\"\",$O68<=0,$Q$35=\"NO\"),\"\",$AX68*$AY68)","v":""},null,{"$f":"IF(OR($E68=\"\",$H68=\"\",$O68<=0,$Q$35=\"NO\"),\"\",VLOOKUP($E68,'Data source'!$B$4:$I$111,4,FALSE))","v":""},{"$f":"IF(OR($E68=\"\",$H68=\"\",$O68<=0,$Q$35=\"NO\"),\"\",(($AX68/$AX$73)*$BC68))","v":""},{"$f":"IF(OR($E68=\"\",$H68=\"\",$O68<=0,$Q$35=\"NO\"),\"\",VLOOKUP($E68,'Data source'!$B$4:$I$111,5,FALSE))","v":""},{"$f":"IF(OR($E68=\"\",$H68=\"\",$O68<=0,$Q$35=\"NO\"),\"\",(($AX68/$AX$73)*BE68))","v":""},{"$f":"IF(OR($E68=\"\",$H68=\"\",$O68<=0,$Q$35=\"NO\"),\"\",VLOOKUP($E68,'Data source'!$B$4:$I$111,6,FALSE))","v":""},{"$f":"IF(OR($E68=\"\",$H68=\"\",$O68<=0,$Q$35=\"NO\"),\"\",(($AX68/$AX$73)*BG68))","v":""},{"$f":"IF(OR($E68=\"\",$H68=\"\",$O68<=0,$Q$35=\"NO\"),\"\",VLOOKUP($E68,'Data source'!$B$4:$I$111,7,FALSE))","v":""},{"$f":"IF(OR($E68=\"\",$H68=\"\",$O68<=0,$Q$35=\"NO\"),\"\",(BI68/100*BH68)*($AX68/$AX$73))","v":""},{"$f":"IF(OR($E68=\"\",$H68=\"\",$O68<=0,$Q$35=\"NO\"),\"\",VLOOKUP($E68,'Data source'!$B$4:$I$111,8,FALSE))","v":""},{"$f":"IF(OR($E68=\"\",$H68=\"\",$O68<=0,$Q$35=\"NO\"),\"\",(($AX68/$AX$73)*BK68))","v":""},null,{"$f":"IF(OR($E68=\"\",$H68=\"\",$O68<=0,$Q$35=\"NO\"),0,VLOOKUP($E68,'Data source'!$B$4:$T$111,13,FALSE))","v":0},{"$f":"IF(OR($E68=\"\",$H68=\"\",$O68<=0,$Q$35=\"NO\"),0,VLOOKUP($E68,'Data source'!$B$4:$T$111,14,FALSE))","v":0},{"$f":"IF(OR($E68=\"\",$H68=\"\",$O68<=0,$Q$35=\"NO\"),0,VLOOKUP($E68,'Data source'!$B$4:$T$111,15,FALSE))","v":0},{"$f":"IF(OR($E68=\"\",$H68=\"\",$O68<=0,$Q$35=\"NO\"),0,VLOOKUP($E68,'Data source'!$B$4:$T$111,17,FALSE))","v":0},{"$f":"IF(OR($E68=\"\",$H68=\"\",$O68<=0,$Q$35=\"NO\"),0,VLOOKUP($E68,'Data source'!$B$4:$T$111,17,FALSE))","v":0},{"$f":"IF(OR($E68=\"\",$H68=\"\",$O68<=0,$Q$35=\"NO\"),0,VLOOKUP($E68,'Data source'!$B$4:$T$111,18,FALSE))","v":0},{"$f":"IF(OR($E68=\"\",$H68=\"\",$O68<=0,$Q$35=\"NO\"),0,VLOOKUP($E68,'Data source'!$B$4:$T$111,19,FALSE))","v":0},null,{"$f":"IF(OR($E68=\"\",$H68=\"\",$O68<=0,$Q$35=\"NO\"),0,((43.498*$BN68)+(25.574*$BO68))-((28.206*$BP68)+(62.375*$BQ68)))*$AX68*10/1000","v":0},null,{"$f":"IF(OR($E68=\"\",$H68=\"\",$O68<=0,$AK67<=0,$Q$35=\"NO\"),\"\",VLOOKUP($E68,'Data source'!$B$15:$M$104,12,FALSE))","v":""},{"$f":"IF(OR($E68=\"\",$H68=\"\",$O68<=0,$AK67<=0,$Q$35=\"NO\"),\"\",IF($BX68=\"Dry\",$AK67/$AW68/10,IF($BX68=\"Wet\",$AK67/($AZ68/100)*$AW68/10,0)))","v":""},{"$f":"IF(OR($E68=\"\",$H68=\"\",$O68<=0,$AK67<=0,AY68=0,$Q$35=\"NO\"),\"\",IF(OR($I56=\"-\",$AS68=\"-\",$O68=0),\"\",BY68/AY68))","v":""},{"$f":"IF(OR($E68=\"\",$H68=\"\",$O68<=0,$AK67<=0,$Q$35=\"NO\"),\"\",IF(OR($I56=\"-\",$AS68=\"-\",$O68=0),\"\",($BY68*$O68)/100))","v":""}]
[null,null,null,null,null,null,null,null,null,null,null,null,null,{"$f":"IF(OR($H$7=\"Dry\", K68=\"\"),\"\",IF(AND(E68=\"PKE\",K68>3),\">3\",\"\"))","v":""},null,null,null,{"$f":"IF(OR($H$7=\"Dry\", O68=\"\"),\"\",IF(AND(E68=\"PKE\",O68>3),\">3\",\"\"))","v":""}]
[null,null,null,null,null,null,null,null,null,null,"OFFERED",null,"EATEN",null,"OFFERED",null,"EATEN",null,null,null,null,null,null,null,null,null,null,null,null,null,null,null,null,null,null,null,null,null,null,"OPTION 1",null,null,"OPTION 2"]
[null,null,null,null,null,null,null,null,null,null,null,null,null,null,null,null,null,null,null,null,null,null,"Cl",{"$f":"IF(Y12=\"No\",\"\",IF($H$7=\"early\",0.25,IF($H$7=\"mid\",0.25,IF($H$7=\"late\",0.25,IF($H$7=\"dry\",IF(AF16=\"YES\",0.25,0.25))))))","v":""},"min",null,{"$f":"IF($K$72>0,BP72,\"\")","v":""},null,{"$f":"IF(AND($Q$35=\"YES\",$O$72>0),BP73,\"\")","v":""}]
[null,null,null,null,"Total feed (kg DM/cow/day)",null,null,null,null,null,{"$f":"SUM(L41,L44,L47,L50,L53,L56,L59,L62,L65,L68)","v":0},null,{"$f":"SUM(M41,M44,M47,M50,M53,M56,M59,M62,M65,M68)","v":0},null,{"$f":"IF(Q35=\"NO\",\"\",SUM(P41,P44,P47,P50,P53,P56,P59,P62,P65,P68))","v":""},null,{"$f":"IF($Q$35=\"YES\",SUM(Q41,Q44,Q47,Q50,Q53,Q56,Q59,Q62,Q65,Q68),\"\")","v":""},null,null,null,null,null,null,null,null,null,null,null,null,null,null,null,null,null,null,null,"$/cow/day",null,null,{"$f":"IF($K$73>0,$CA$72,\"\")","v":""},null,null,{"$f":"IF(AND($Q$35=\"Yes\",$O$73>0),$CA$73,\"\")","v":""},null,null,null,"OPTION",1,null,{"$f":"IF(SUM(AX40,AX43,AX46,AX49,AX52,AX55,AX58,AX61,AX64,AX67)>0,SUM(AX40,AX43,AX46,AX49,AX52,AX55,AX58,AX61,AX64,AX67),\"\")","v":""},null,null,{"$f":"IF(SUM(BA40,BA43,BA46,BA49,BA52,BA55,BA58,BA61,BA64,BA67)>0,SUM(BA40,BA43,BA46,BA49,BA52,BA55,BA58,BA61,BA64,BA67),\"\")","v":""},null,null,{"$f":"IF(SUM(BD40,BD43,BD46,BD49,BD52,BD55,BD58,BD61,BD64,BD67)>0,SUM(BD40,BD43,BD46,BD49,BD52,BD55,BD58,BD61,BD64,BD67),\"\")","v":""},null,{"$f":"IF(SUM(BF40,BF43,BF46,BF49,BF52,BF55,BF58,BF61,BF64,BF67)>0,SUM(BF40,BF43,BF46,BF49,BF52,BF55,BF58,BF61,BF64,BF67),\"\")","v":""},null,{"$f":"IF(SUM(BH40,BH43,BH46,BH49,BH52,BH55,BH58,BH61,BH64,BH67)>0,SUM(BH40,BH43,BH46,BH49,BH52,BH55,BH58,BH61,BH64,BH67),\"\")","v":""},null,{"$f":"IF(SUM(BJ40,BJ43,BJ46,BJ49,BJ52,BJ55,BJ58,BJ61,BJ64,BJ67)>0,SUM(BJ40,BJ43,BJ46,BJ49,BJ52,BJ55,BJ58,BJ61,BJ64,BJ67),\"\")","v":""},null,{"$f":"IF(SUM(BL40,BL43,BL46,BL49,BL52,BL55,BL58,BL61,BL64,BL67)>0,SUM(BL40,BL43,BL46,BL49,BL52,BL55,BL58,BL61,BL64,BL67),\"\")","v":""},null,{"$f":"IF((SUM(BN40,BN43,BN46,BN49,BN52,BN55,BN58,BN61,BN64,BN67))>0,SUM(($AX$40/$AX$72*BN40)+($AX$43/$AX$72*BN43)+($AX$46/$AX$72*BN46)+($AX$49/$AX$72*BN49)+($AX$52/$AX$72*BN52)+($AX$55/$AX$72*BN55)+($AX$58/$AX$72*BN58)+($AX$61/$AX$72*BN61)+($AX$64/$AX$72*BN64)+($AX$67/$AX$72*BN67)),\"\")","v":""},"","",{"$f":"IF((SUM(BQ40,BQ43,BQ46,BQ49,BQ52,BQ55,BQ58,BQ61,BQ64,BQ67))>0,SUM(($AX$40/$AX$72*BQ40)+($AX$43/$AX$72*BQ43)+($AX$46/$AX$72*BQ46)+($AX$49/$AX$72*BQ49)+($AX$52/$AX$72*BQ52)+($AX$55/$AX$72*BQ55)+($AX$58/$AX$72*BQ58)+($AX$61/$AX$72*BQ61)+($AX$64/$AX$72*BQ64)+($AX$67/$AX$72*BQ67)),\"\")","v":""},"","",{"$f":"IF((SUM(BT40,BT43,BT46,BT49,BT52,BT55,BT58,BT61,BT64,BT67))>0,SUM(($AX$40/$AX$72*BT40)+($AX$43/$AX$72*BT43)+($AX$46/$AX$72*BT46)+($AX$49/$AX$72*BT49)+($AX$52/$AX$72*BT52)+($AX$55/$AX$72*BT55)+($AX$58/$AX$72*BT58)+($AX$61/$AX$72*BT61)+($AX$64/$AX$72*BT64)+($AX$67/$AX$72*BT67)),\"\")","v":""},null,{"$f":"(BV40+BV43+BV46+BV49+BV52+BV55+BV58+BV61+BV64+BV67)","v":0},null,"$/mob",{"$f":"CA72*$O$6","v":0},"$/cow",{"$f":"SUM(CA43,CA46,CA49,CA52,CA55,CA58,CA61,CA64,CA67)","v":0}]
[null,null,null,null,"Supplement (kg DM/cow/day)",null,null,null,null,null,{"$f":"SUM(L44,L47,L50,L53,L56,L59,L62,L65,L68)","v":0},null,{"$f":"SUM(M44,M47,M50,M53,M56,M59,M62,M65,M68)","v":0},null,{"$f":"(IF(Q35=\"YES\",SUM(P44,P47,P50,P53,P56,P59,P62,P65,P68),\"\"))","v":""},null,{"$f":"IF($Q$35=\"YES\",SUM(Q44,Q47,Q50,Q53,Q56,Q59,Q62,Q65,Q68),\"\")","v":""},null,null,null,null,null,null,null,null,null,null,null,null,null,null,null,null,null,null,null,"$/mob/day",null,null,{"$f":"IF(AND($K$73>0,$O$6>0),$BY$72,\"\")","v":""},null,null,{"$f":"IF(AND($Q$35=\"Yes\",$O$73>0,$O$6>0),$BY$73,\"\")","v":""},null,null,null,"OPTION",2,null,{"$f":"IF(SUM(AX41,AX44,AX47,AX50,AX53,AX56,AX59,AX62,AX65,AX68)>0,SUM(AX41,AX44,AX47,AX50,AX53,AX56,AX59,AX62,AX65,AX68),\"\")","v":""},null,null,{"$f":"IF($O$72>0,SUM(BA41,BA44,BA47,BA50,BA53,BA56,BA59,BA62,BA65,BA68),\"\")","v":0},null,null,{"$f":"IF($O$72>0,SUM(BD41,BD44,BD47,BD50,BD53,BD56,BD59,BD62,BD65,BD68),\"\")","v":0},null,{"$f":"IF($O$72>0,SUM(BF41,BF44,BF47,BF50,BF53,BF56,BF59,BF62,BF65,BF68),\"\")","v":0},null,{"$f":"IF($O$72>0,SUM(BH41,BH44,BH47,BH50,BH53,BH56,BH59,BH62,BH65,BH68),\"\")","v":0},null,{"$f":"IF($O$72>0,SUM(BJ41,BJ44,BJ47,BJ50,BJ53,BJ56,BJ59,BJ62,BJ65,BJ68),\"\")","v":0},null,{"$f":"IF($O$72>0,SUM(BL41,BL44,BL47,BL50,BL53,BL56,BL59,BL62,BL65,BL68),\"\")","v":0},null,{"$f":"IF((SUM(BN41,BN44,BN47,BN50,BN53,BN56,BN59,BN62,BN65,BN68))>0,SUM(($AX$41/$AX$73*BN41)+($AX$44/$AX$73*BN44)+($AX$47/$AX$73*BN47)+($AX$50/$AX$73*BN50)+($AX$53/$AX$73*BN53)+($AX$56/$AX$73*BN56)+($AX$59/$AX$73*BN59)+($AX$62/$AX$73*BN62)+($AX$65/$AX$73*BN65)+($AX$68/$AX$73*BN68)),\"\")","v":""},"","",{"$f":"IF((SUM(BQ41,BQ44,BQ47,BQ50,BQ53,BQ56,BQ59,BQ62,BQ65,BQ68))>0,SUM(($AX$41/$AX$73*BQ41)+($AX$44/$AX$73*BQ44)+($AX$47/$AX$73*BQ47)+($AX$50/$AX$73*BQ50)+($AX$53/$AX$73*BQ53)+($AX$56/$AX$73*BQ56)+($AX$59/$AX$73*BQ59)+($AX$62/$AX$73*BQ62)+($AX$65/$AX$73*BQ65)+($AX$68/$AX$73*BQ68)),\"\")","v":""},"","",{"$f":"IF((SUM(BT41,BT44,BT47,BT50,BT53,BT56,BT59,BT62,BT65,BT68))>0,SUM(($AX$41/$AX$73*BT41)+($AX$44/$AX$73*BT44)+($AX$47/$AX$73*BT47)+($AX$50/$AX$73*BT50)+($AX$53/$AX$73*BT53)+($AX$56/$AX$73*BT56)+($AX$59/$AX$73*BT59)+($AX$62/$AX$73*BT62)+($AX$65/$AX$73*BT65)+($AX$68/$AX$73*BT68)),\"\")","v":""},null,{"$f":"SUM(BV41,BV44,BV47,BV50,BV53,BV56,BV59,BV62,BV65,BV68)","v":0},null,null,{"$f":"CA73*O6","v":0},null,{"$f":"SUM(CA44,CA47,CA50,CA53,CA56,CA59,CA62,CA65,CA68)","v":0}]
[null,null,{"$f":"IF(C56=\"Hay_Silage\",\"i\",\"\")","v":""},null,null,null,null,null,null,null,null,null,null,null,null,null,null,null,null,null,null,null,"S",{"$f":"IF($Y$12=\"No\",\"\",IF($H$7=\"early\",0.25,IF($H$7=\"mid\",0.25,IF($H$7=\"late\",0.25,IF($H$7=\"dry\",IF(AF16=\"YES\",0.25,0.25))))))","v":""},"min",null,{"$f":"IF($K$72>0,BQ72,\"\")","v":""},null,{"$f":"IF(AND($Q$35=\"YES\",$O$72>0),BQ73,\"\")","v":""}]
[]
[]
[null,null,null,null,null,null,null,null,null,null,null,null,null,null,null,null,null,null,null,null,null,null,"Mg",{"$f":"IF($Y$12=\"No\",\"\",IF($H$7=\"early\",0.4,IF($H$7=\"mid\",0.25,IF($H$7=\"late\",0.25,IF($H$7=\"dry\",IF(AF16=\"YES\",0.4,0.3))))))","v":""},"min",null,{"$f":"IF($K$72>0,BR72,\"\")","v":""},null,{"$f":"IF(AND($Q$35=\"YES\",$O$72>0),BR73,\"\")","v":""}]
[]
[]
[null,null,null,null,null,null,null,null,null,null,null,null,null,null,null,null,null,null,null,null,null,null,"Ca",{"$f":"IF($Y$12=\"NO\",\"\",IF($H$7=\"early\",\"1.1\",IF($H$7=\"mid\",\"0.8\",IF($H$7=\"late\",\"0.6\",IF($H$7=\"dry\",IF($AF$15=\"YES\",0.5,\"0.50\"))))))","v":""},"min",{"$f":"IF(AF15=\"YES\",\"i\",\"\")","v":""},{"$f":"IF($K$72>0,BS72,\"\")","v":""},{"$f":"IF(H7=\"DRY\",\"\",\"i\")","v":"i"},{"$f":"IF(AND($Q$35=\"YES\",$O$72>0),BS73,\"\")","v":""},{"$f":"IF(H7=\"DRY\",\"\",\"i\")","v":"i"}]
[]
[null,null,null,null,null,null,null,null,null,null,null,null,null,null,null,null,null,null,null,null,null,null,null,{"$f":"IF($Y$12=\"NO\",\"\",IF($H$7=\"early\",0.8,IF($H$7=\"mid\",0.6,IF($H$7=\"late\",0.6,IF($H$7=\"dry\",IF($AF$15=\"YES\",2,0.3))))))","v":""},"max",null,{"$f":"IF($K$72>0,BS72,\"\")","v":""},null,{"$f":"IF(AND($Q$35=\"YES\",$O$72>0),BS73,\"\")","v":""}]
[]
[]
[null,null,null,null,null,null,null,null,null,null,null,null,null,null,null,null,null,null,null,null,null,null,"P",{"$f":"IF($Y$12=\"No\",\"\",IF($H$7=\"early\",0.35,IF($H$7=\"mid\",0.3,IF($H$7=\"late\",0.3,IF($H$7=\"dry\",IF(AF15=\"YES\",0.25,0.3))))))","v":""},"min",{"$f":"IF(AF15=\"YES\",\"i\",\"\")","v":""},{"$f":"IF($K$72>0,BT72,\"\")","v":""},null,{"$f":"IF(AND($Q$35=\"YES\",$O$72>0),BT73,\"\")","v":""}]
[]
[null,null,null,null,null,null,null,null,null,null,null,null,null,null,null,null,null,null,null,null,null,null,null,{"$f":"IF($Y$12=\"NO\",\"\",IF($H$7=\"early\",\"0.35\",IF($H$7=\"mid\",\"0.30\",IF($H$7=\"late\",\"0.30\",IF($H$7=\"dry\",IF(AF15=\"YES\",0.45,\"0.35\"))))))","v":""},"max",null,{"$f":"IF($K$72>0,BT72,\"\")","v":""},null,{"$f":"IF(AND($Q$35=\"YES\",$O$72>0),BT73,\"\")","v":""}]
[]
[]
[null,null,null,null,null,null,null,null,null,null,null,null,null,null,null,null,null,null,null,null,null,null,"DCAD calculations?",null,null,null,null,null,"NO"]
[null,null,null,null,null,null,null,null,null,null,null,null,null,null,null,null,null,null,null,null,null,null,"DCAD",null,null,null,null,null,{"$f":"IF(AND($H$7=\"Dry\",AD15=\"YES\",AC90=\"YES\"),\"YES\",\"NO\")","v":"NO"}]
[null,null,null,null,null,null,null,null,null,null,null,null,null,null,null,null,null,null,null,null,null,null,null,"meq/100g DM"]
[null,null,null,null,null,null,null,null,null,null,null,null,null,null,null,null,null,null,null,null,null,null,"DCAD                    (mEq/100g DM)","<0",null,{"$f":"IF(AC90=\"YES\",\"i\",\"\")","v":""},{"$f":"BV72","v":0},null,{"$f":"BV73","v":0}]

{"sheet":"CUSTOM FEED SET-UP","index":2,"n_rows":43,"n_cols":24,"rows_kept":43,"cut":false,"hidden":false,"merged":[]}
[null,null,"%bulb","%leaf"]
["Custom fodder beet ratio","Custom: Bulb% & Leaf%",null,null,"Use this with default fodder beet feeding values"]
["FODDER BEET DEFAULT",null,null,null,"DM ","ME","CP","NDF","SSS","starch","fat","BP P","Sol P","Degrad P","Dry/Wet","Na","K","Cl","S","Mg","Ca","P"]
[null,"Fodder beet_Default","%bulb","%leaf","%","MJ/kg DM","%DM","%DM","%DM","%SSS","%DM","%CP","%CP","%CP","$","%DM","%DM","%DM","%DM","%DM","%DM","%DM"]
[null,"Bulb only",100,{"$f":"100-C5","v":0},{"$f":"'Data source'!C46","v":10},{"$f":"'Data source'!D46","v":12},{"$f":"'Data source'!E46","v":8.6},{"$f":"'Data source'!F46","v":11.4},{"$f":"'Data source'!G46","v":64},{"$f":"'Data source'!H46","v":5},{"$f":"'Data source'!I46","v":0},{"$f":"'Data source'!J46","v":0},{"$f":"'Data source'!K46","v":0},{"$f":"'Data source'!L46","v":0},{"$f":"'Data source'!M46","v":"Dry"},{"$f":"'Data source'!N46","v":0.3},{"$f":"'Data source'!O46","v":2},{"$f":"'Data source'!P46","v":0.3},{"$f":"'Data source'!Q46","v":7.0000000000000007E-2},{"$f":"'Data source'!R46","v":0.16},{"$f":"'Data source'!S46","v":0.14000000000000001},{"$f":"'Data source'!T46","v":0.13}]
[null,"Leaf only",0,100,{"$f":"'Data source'!C47","v":17},{"$f":"'Data source'!D47","v":10.4},{"$f":"'Data source'!E47","v":20},{"$f":"'Data source'!F47","v":32},{"$f":"'Data source'!G47","v":17.5},{"$f":"'Data source'!H47","v":0},{"$f":"'Data source'!I47","v":0},{"$f":"'Data source'!J47","v":0},{"$f":"'Data source'!K47","v":0},{"$f":"'Data source'!L47","v":0},{"$f":"'Data source'!M47","v":"Dry"},{"$f":"'Data source'!N47","v":1.3},{"$f":"'Data source'!O47","v":3.2},{"$f":"'Data source'!P47","v":0.3},{"$f":"'Data source'!Q47","v":0.3},{"$f":"'Data source'!R47","v":1},{"$f":"'Data source'!S47","v":1.8},{"$f":"'Data source'!T47","v":0.3}]
["Spring","Bulb 90% Leaf 10%",90,10,{"$f":"((E$6*$D7/100)+(E$5*$C7/100))","v":10.7},{"$f":"((F$6*$D7/100)+(F$5*$C7/100))","v":11.84},9.74,{"$f":"((H$6*$D7/100)+(H$5*$C7/100))","v":13.46},59.35,4.5,0,0,0,0,"Dry",{"$f":"((P$6*$D7/100)+(P$5*$C7/100))","v":0.4},2.12,0.30000000000000004,9.2999999999999999E-2,0.24400000000000002,0.30599999999999999,0.14700000000000002]
["Late spring","Bulb 85% Leaf 15%",85,15,{"$f":"((E$6*$D8/100)+(E$5*$C8/100))","v":11.05},11.76,10.309999999999999,14.489999999999998,57.024999999999999,4.25,{"$f":"((K$6*$D8/100)+(K$5*$C8/100))","v":0},0,0,0,"Dry",0.45,2.1799999999999997,0.3,0.10450000000000001,0.28600000000000003,0.38900000000000001,0.1555]
["Summer","Bulb 80% Leaf 20%",80,20,{"$f":"((E$6*$D9/100)+(E$5*$C9/100))","v":11.4},{"$f":"((F$6*$D9/100)+(F$5*$C9/100))","v":11.68},10.879999999999999,15.52,54.7,4,0,0,0,0,"Dry",0.5,2.2400000000000002,0.3,0.11600000000000001,0.32800000000000001,0.47199999999999998,0.16400000000000001]
["Late Summer","Bulb 75% Leaf 25%",75,25,{"$f":"((E$6*$D10/100)+(E$5*$C10/100))","v":11.75},11.6,11.45,16.55,52.375,3.75,0,0,0,0,"Dry",0.55000000000000004,2.2999999999999998,0.3,0.1275,0.37,0.55500000000000005,0.17249999999999999]
["Winter","Bulb 70% leaf 30%",70,30,{"$f":"((E$6*$D11/100)+(E$5*$C11/100))","v":12.1},11.52,12.02,17.579999999999998,50.05,3.5,0,0,0,0,"Dry",0.6,2.36,0.3,0.13900000000000001,0.41200000000000003,0.63800000000000001,0.18099999999999999]
[null,"Custom: Bulb% & Leaf%",{"$f":"C2","v":0},{"$f":"D2","v":0},{"$f":"((E$6*$D2/100)+(E$5*$C2/100))","v":0},0,0,0,0,0,0,0,0,0,"Dry",{"$f":"((P$6*$D2/100)+(P$5*$C2/100))","v":0},0,0,0,0,0,0]
[]
["Custom bulb crop ratio"," Custom: Bulb% & Leaf%",null,null,"Use this with custom bulb crop feed values below"]
["CUSTOM BULB CROPS",null,null,null,"DM ","ME","CP","NDF","SSS","starch","fat","BP P","Sol P","Degrad P","Dry/Wet","Na","K","Cl","S","Mg","Ca","P"]
[null,"Custom_Crops","%bulb","%leaf","%","MJ/kg DM","%DM","%DM","%DM","%SSS","%DM","%CP","%CP","%CP","$","%DM","%DM","%DM","%DM","%DM","%DM","%DM"]
[null," Bulb only",100,{"$f":"100-C17","v":0},{"$f":"E28","v":0},{"$f":"F28","v":0},0,0,0,0,0,0,0,0,{"$f":"O28","v":0},0,0,0,0,0,0,0]
[null," Leaf only",0,100,{"$f":"E29","v":0},{"$f":"F29","v":0},0,0,0,0,0,0,0,0,{"$f":"O29","v":0},0,0,0,0,0,0,0]
["Spring"," Bulb 90% Leaf 10%",90,10,{"$f":"((E$18*$D19/100)+(E$17*$C19/100))","v":0},0,0,0,0,0,0,0,0,0,{"$f":"O17","v":0},0,0,0,0,0,0,0]
["Late spring"," Bulb 85% Leaf 15%",85,15,{"$f":"((E$18*$D20/100)+(E$17*$C20/100))","v":0},{"$f":"((F$18*$D20/100)+(F$17*$C20/100))","v":0},0,0,0,0,0,0,0,0,{"$f":"O18","v":0},{"$f":"((P$18*$D20/100)+(P$17*$C20/100))","v":0},0,0,0,0,0,0]
["Summer"," Bulb 80% Leaf 20%",80,20,0,0,0,0,0,0,0,0,0,0,0,0,0,0,0,0,0,0]
["Late Summer"," Bulb 75% Leaf 25%",75,25,{"$f":"((E$18*$D22/100)+(E$17*$C22/100))","v":0},0,0,0,0,0,0,0,0,0,0,0,0,0,0,0,0,0]
["Winter"," Bulb 70% leaf 30%",70,30,0,0,0,0,0,0,0,0,0,0,{"$f":"O21","v":0},0,0,0,0,0,0,0]
[null," Custom: Bulb% & Leaf%",{"$f":"C14","v":0},{"$f":"D14","v":0},{"$f":"((E$18*$D14/100)+(E$17*$C14/100))","v":0},0,0,{"$f":"((H$18*$D14/100)+(H$17*$C14/100))","v":0},0,0,0,0,0,0,0,0,0,0,0,0,0,0]
[]
["Add custom bulb crop analysis here",null,null,null,"DM ","ME","CP","NDF","SSS","starch","fat","BP P","Sol P","Degrad P","Dry/Wet","Na","K","Cl","S","Mg","Ca","P"]
[null,null,"%bulb","%leaf","%","MJ/kg DM","%DM","%DM","%DM","%SSS","%DM","%CP","%CP","%CP","$","%DM","%DM","%DM","%DM","%DM","%DM","%DM"]
[null,"Custom bulb",100,0]
[null,"Custom leaf",0,100]
[]
[]
["Add custom feed and mineral analysis here",null,null,null,"DM ","ME","CP","NDF","SSS","starch","fat","BP P","Sol P","Degrad P","Dry/Wet","Na","K","Cl","S","Mg","Ca","P"]
[null,"Custom_Feeds_&_Minerals",null,null,"%","MJ/kg DM","%DM","%DM","%DM","%SSS","%DM","%CP","%CP","%CP","$","%DM","%DM","%DM","%DM","%DM","%DM","%DM",null,"Leaf available"]
[null,"Custom feed 1",null,null,null,null,null,null,null,null,null,null,null,null,null,null,null,null,null,null,null,null,null,{"$f":"IF(D34<>\"Leaf (if available)\",\"\",IF(COUNTA($E34:$V34)=18,1,0))","v":""}]
[null,"Custom feed 2",null,null,null,null,null,null,null,null,null,null,null,null,null,null,null,null,null,null,null,null,null,""]
[null,"Custom feed 3"]
[null,"Custom feed 4",null,null,null,null,null,null,null,null,null,null,null,null,null,null,null,null,null,null,null,null,null,""]
[null,"Custom feed 5",null,null,null,null,null,null,null,null,null,null,null,null,null,null,null,null,null,null,null,null,null,""]
[null,"Custom feed 6",null,null,null,null,null,null,null,null,null,null,null,null,null,null,null,null,null,null,null,null,null,""]
[null,"Custom feed 7",null,null,null,null,null,null,null,null,null,null,null,null,null,null,null,null,null,null,null,null,null,""]
[null,"Custom feed 8",null,null,null,null,null,null,null,null,null,null,null,null,null,null,null,null,null,null,null,null,null,""]
[null,"Custom feed 9"]
[null,"Custom feed 10"]

{"sheet":"   ASK    ","index":3,"n_rows":36,"n_cols":35,"rows_kept":36,"cut":false,"hidden":true,"merged":[[33,12,33,14],[34,12,34,14],[33,18,33,20],[32,18,32,20],[35,12,35,14],[4,1,4,5],[4,13,4,17],[4,7,4,11],[4,19,4,26],[32,12,32,14]]}
[null,null,null,null,null,null,null,null,null,null,"Today",null,null,null,null,null,"Calcs from this date (optional)"]
[null,null,null,null,"FARM  INPUTS",null,null,null,null,null,{"$f":"TODAY()","v":"2022-12-06"}]
[]
[]
[null,"FARM",null,null,null,null,null,"COWS",null,null,null,null,null,"PASTURE",null,null,null,null,null,"SUPPLEMENT ON HAND/CONTRACT"]
[]
[null,null,null,null,"PLATFORM SIZE (Effective Ha)",null,null,null,null,null,"BREED",null,null,null,null,null,"CURRENT TOTAL GRAZABLE AREA (ha)",null,null,null,null,null,"FEED TYPE",null,"FEED",null,"Available (t)"]
[null,null,null,null,100,null,null,null,null,null,"Friesian","*",null,null,null,null,90,null,null,null,null,"Feed 1","Hay_Silage","*","Hay pasture good","*",14,null,null,null,null,null,"KEY"]
[]
[null,null,null,null,"TERRAIN",null,null,null,null,null,"AVERAGE LIVEWEIGHT",null,null,null,null,null,"AREA GRAZED/DAY (ha) all mobs",null,null,null,null,null,null,null,null,null,null,null,null,null,null,null,"Select from drop-down menu",null,"-"]
[null,null,null,null,"flat",null,null,null,null,null,600,"*",null,null,null,null,3,null,null,null,null,"Feed 2","Concentrates","*","Barley","*",10,null,null,null,null,null,"Enter values"]
[null,null,null,null,null,null,null,null,null,null,null,null,null,null,null,null,null,null,null,null,null,null,null,null,null,null,null,null,null,null,null,null,"Required for the ASSESS page",null,"*"]
[null,null,null,null,"PLANNED START OF CALVING (PSC)",null,null,null,null,null,"STAGE OF LACTATION",null,null,null,null,null,"AVERAGE PASTURE COVER"]
[null,null,null,null,"2017-07-01"," (next calving)",null,null,null,null,"Late","*",null,null,null,null,2400,null,null,null,null,"Feed 3","Forages","*","Chicory","*",20]
[]
[null,null,null,null,null,null,null,null,null,null,"TOTAL COWS (at peak)"]
[null,null,null,null,null,null,null,null,null,null,330,null,null,null,null,null,null,null,null,null,null,"Feed 4","By_products","*","PKE","*",5]
[]
[null,null,null,null,null,null,null,null,null,null,"COWS ON FARM NOW"]
[null,null,null,null,null,null,null,null,null,null,280,null,null,null,null,null,null,null,null,null,null,"Feed 5","Minerals","*","CaCO3, %DM","*",0.2]
[]
[null,null,null,null,null,null,null,null,null,null,"BCS (herd avg)"]
[null,null,null,null,null,null,null,null,null,null,4,null,null,null,null,null,null,null,null,null,null,"Feed 6","Concentrates","*","Maize grain","*",8]
[]
[]
[null,null,null,null,null,null,null,null,null,null,null,null,null,null,null,null,null,null,null,null,null,null,null,null,"Minerals  with conc. supplement  Y/N?",null,"NO"]
[null,null,null,null,null,null,null,null,null,null,null,null,null,null,null,null,null,null,null,null,null,null,{"$f":"IF(AA26=\"Yes\",\"Take account of minerals fed when changing supplement allowances\",\"\")","v":""}]
[null,null,null,null,null,null,null,null,null,null,null,"All FARM/COW/PASTURE inputs complete?",null,null,null,null,null,{"$f":"IF(OR(E8=\"\",E11=\"-\",E14=\"\",K8=\"-\",K11=\"-\",K14=\"-\",K17=\"\",K20=\"\",K23=\"-\",Q8=\"\",Q11=\"\",Q14=\"\"),\"No\",\"YES\")","v":"YES"}]
[]
[null,null,null,null,null,null,null,null,null,null,null,null,null,null,null,null,"CALCULATIONS"]
[]
[]
[null,null,null,null,null,null,null,null,null,null,"Stocking rate at peak (cows/ha)",null,{"$f":"IF($R$28=\"Yes\",$K$17/$E$8,\"\")","v":3.3},null,null,null,"Rotation length",null,{"$f":"IF(R28=\"Yes\",Q8/Q11,\"\")","v":30}]
[null,null,null,null,null,null,null,null,null,null,"kg LWT/ha",null,{"$f":"IF($R$28=\"Yes\",($K$17*$K$11)/$E$8,\"\")","v":1980},null,null,null,"Weeks until PSC",null,{"$f":"IF(R28=\"Yes\",IF(Q2>0,((E14-Q2)/7),(E14-K2)/7),\"\")","v":-283.42857142857144}]
[null,null,null,null,null,null,null,null,null,null,"Current Stocking rate (cows/ha)",null,{"$f":"IF(R28=\"Yes\",K20/Q8,\"\")","v":3.1111111111111112}]
[null,null,null,null,null,null,null,null,null,null,"Current kg LWT/ha",null,{"$f":"IF($R$28=\"Yes\",($K$20*$K$11)/$Q$8,\"\")","v":1866.6666666666667}]

{"sheet":"OBSERVE","index":4,"n_rows":0,"n_cols":0,"rows_kept":0,"cut":false,"hidden":true,"merged":[]}

{"sheet":"ASSESS & COMPARE","index":5,"n_rows":74,"n_cols":89,"rows_kept":74,"cut":false,"hidden":true,"merged":[[12,1,12,5],[5,21,5,25],[1,1,1,2],[1,21,1,26],[4,1,4,5],[4,21,4,26],[2,13,2,14],[24,6,24,7],[6,21,6,25],[7,21,7,25],[8,21,8,25],[11,50,11,56],[23,29,23,30],[23,32,23,33],[23,35,23,36],[23,38,23,39],[23,41,23,42],[13,64,13,65],[22,1,22,5],[22,44,22,47],[22,50,22,56],[22,59,22,66],[13,6,13,7],[26,1,27,1],[26,2,27,2],[26,4,27,4],[26,6,27,7],[38,1,39,1],[38,2,39,2],[38,4,39,4],[38,6,39,7],[32,1,33,1],[32,2,33,2],[32,4,33,4],[32,6,33,7],[29,1,30,1],[29,2,30,2],[29,4,30,4],[29,6,30,7],[32,88,32,89],[35,1,36,1],[35,2,36,2],[35,4,36,4],[35,6,36,7],[32,82,32,83],[32,85,32,86],[48,6,48,7],[41,1,42,1],[41,2,42,2],[41,4,42,4],[41,6,42,7],[44,1,45,1],[44,2,45,2],[44,4,45,4],[44,6,45,7]]}
[]
[null," INPUTS",null,null,null,null,"Today",null,null,null,null,null,"Calcs from this date",null,null,null,null,null,null,null,null,"CALCULATIONS"]
[null,null,null,null,null,null,{"$f":"TODAY()","v":"2022-12-06"},null,null,null,null,null,null,"2017-05-22",null,null,null,null,null,null,null,null,null,null,null,null,null,null,null,null,null,null,null,"KEY",null,null,null,"ENERGY REQUIREMENTS"]
[null,null,null,null,null,null,null,null,null,null,null,null,null,null,null,null,null,null,null,null,null,null,null,null,null,null,null,null,null,null,null,null,null,null,null,null,null,null,null,null,null,null,"MJME/cow",null,null,null,null,null,null,null,null,null,null,null,null,null,null,null,null,null,null,null,null,null,null,null,null,null,null,null,null,null,null,null,null,null,"Background calcs (these could be hidden or somewhere else)"]
[null,"MOB INPUTS",null,null,null,null,null,null,null,null,null,null,null,null,null,null,null,null,null,null,null,"CALCULATION OPTIONS",null,null,null,null,null,null,"Select from drop down list",null,null,null,null,null,"Jersey",null,null,"maintenance",null,null,null,null,{"$f":"IF($J$53=\"Yes\",VLOOKUP(G8,'Data source'!$B$190:$C$199,2,FALSE),\"\")","v":""}]
[null,null,"Breed",null,null,null,{"$f":"IF('   ASK    '!K8=\"\",\"\",'   ASK    '!K8)","v":"Friesian"},null,"Cows in mob",null,null,null,null,null,150,null,null,null,null,null,null,"COMPARE TWO FEEDING OPTIONS",null,null,null,null,"YES",null,"Enter values - Option 1",null,null,null,null,null,2,null,null,"total MS production",null,null,null,null,{"$f":"IF($J$53=\"Yes\",$O$7*$BZ$12,\"\")","v":""}]
[null,null,"Stage of lactation",null,null,null,{"$f":"IF('   ASK    '!K14=\"\",\"\",'   ASK    '!K14)","v":"Late"},null,"Milk solids (kg MS/cow/day)",null,null,null,null,null,1.1000000000000001,null,null,null,null,null,null,"COST OF FEED",null,null,null,null,"YES",null,"Calculated value",null,null,null,null,null,null,null,null,"daily BCS gain/loss",null,null,null,null,{"$f":"IF($J$53=\"Yes\",IF($G$9<0,$CE$9,IF($G$9>0,$CE$10,0)),\"\")","v":""},null,null,null,null,null,null,null,null,null,null,null,null,null,null,null,null,null,null,null,null,null,null,null,null,null,null,null,null,null,null,null,null,null,null,"Option 1","Option 2",null,null,null,"Option 1","Option 2",null,null,"Option 1",null,"Option 2"]
[null,null,"Average liveweight (kg)",null,null,null,{"$f":"IF('   ASK    '!K11=\"\",\"\",'   ASK    '!K11)","v":600},null,"Terrain",null,null,null,null,null,{"$f":"IF('   ASK    '!E11=\"\",\"\",'   ASK    '!E11)","v":"flat"},null,null,null,null,null,null,"CRUDE PROTEIN COMPONENTS",null,null,null,null,"YES",null,"Out of recommended range",null,null,null,null,null,null,null,null,"pregnancy",null,null,null,null,{"$f":"IF($J$53=\"Yes\",BZ13,\"\")","v":""},null,null,null,null,null,null,null,null,null,null,null,null,null,null,null,null,null,null,null,null,null,null,null,null,null,null,null,null,null,null,null,null,null,"stage of lactation",{"$f":"IF($G$7=\"-\",\"\",VLOOKUP($G$7,'Data source'!$B$251:$C$254,2,FALSE))","v":14},{"$f":"$BZ$8","v":14},null,"change LWT/d",null,{"$f":"IF(OR(G8=\"-\",G9=\"-\"),\"\",ABS($G$8*0.0658*$G$9)/30)","v":0.13159999999999999},{"$f":"CE8","v":0.13159999999999999},null,"Average ME of diet (MJ ME)",{"$f":"$AB$16/$Y$49","v":{"$error":"#VALUE!"}},null,{"$f":"IF($Y$50=\"\",\"\",$AB$18/$Y$50)","v":""}]
[null,null,"Estimated  BCS loss/gain next month",null,null,null,-0.1,null,"Total daily walking distance (km)",null,null,null,null,null,1.5,null,null,null,null,null,null,"MINERALS",null,null,null,null,"NO",null,null,null,null,null,null,null,null,null,null,"total activity",null,null,null,null,{"$f":"IF($J$53=\"Yes\",$BZ$14*O9,\"\")","v":""},null,null,null,null,null,null,null,null,null,null,null,null,null,null,null,null,null,null,null,null,null,null,null,null,null,null,null,null,null,null,null,null,null,"breed",{"$f":" IF($G$6=\"-\",\"\",IF($G$6=\"Jersey\",\"j\",IF($G$6=\"Friesian\",\"f\",IF($G$6=\"cross-bred\",\"x\",\"-\"))))","v":"f"},{"$f":"BZ9","v":"f"},null,"ME loss/d",null,{"$f":" IF($G$7=\"-\",\"\",IF($G$7=\"dry\",$CE$8*-30,$CE$8*-37))","v":-4.8692000000000002},{"$f":"CE9","v":-4.8692000000000002},null,"Total DMI requirements (kg DM)",{"$f":"$AQ$10/$CI$8","v":{"$error":"#VALUE!"}},null,{"$f":"IF(CK8=\"\",\"\",CI9)","v":""}]
[null,null,"Planned start of calving - next season",null,null,null,{"$f":"IF('   ASK    '!E14=\"\",\"\",'   ASK    '!E14)","v":"2017-07-01"},null,"Weeks to PSC next season",null,null,null,null,null,{"$f":"IF(G10=\"\",\"<--- enter PSC\",IF(N3=\"\",(G10-G3)/7,(G10-N3)/7))","v":5.7142857142857144},null,null,null,null,null,null,null,null,null,null,null,null,null,null,null,null,null,null,null,null,null,null,"Total ME requirements",null,null,null,null,{"$f":"IF($J$53=\"Yes\",SUM(AQ5:AQ9),\"\")","v":""},null,null,null,null,null,null,null,null,null,null,null,null,null,null,null,null,null,null,null,null,null,null,null,null,null,null,null,null,null,null,null,null,null,"energy density of diet",{"$f":"IF($CI$8<=10.5,1,IF(AND($CI$8>10.5,$CI$8<11.5),2,IF($CI$8>=11.5,3,\"\")))","v":{"$error":"#VALUE!"}},{"$error":"#VALUE!"},null,"ME gain/d",null,{"$f":"IF($G$7=\"-\",\"\",IF($G$7=\"dry\",$CE$8*72,$CE$8*50))","v":6.58},{"$f":"CE10","v":6.58},null,"Difference in ME  intake (MJ)",{"$f":"AB16-$AQ$10","v":{"$error":"#VALUE!"}},null,{"$f":"IF($AB$18=\"\",\"\",$AB$18-$AQ$10)","v":""}]
[null,null,null,null,null,null,null,null,null,null,null,null,null,null,null,null,null,null,null,null,null,null,null,null,null,null,null,null,null,null,null,null,null,null,null,null,null,null,null,null,null,null,null,null,null,null,null,null,null,null,null,null,null,null,null,null,null,null,null,null,null,null,null,null,null,null,null,null,null,null,null,null,null,null,null,null,"wk precalving",{"$f":"IF(O10=\"\",\"\",IF($O$10>12,\"12+\",$O$10))","v":5.7142857142857144},5.7142857142857144,null,"DM difference",null,{"$f":"CI11","v":{"$error":"#VALUE!"}},{"$error":"#VALUE!"},null,"Difference in DMI (kg DM)",{"$f":"$CI$10/$CI$8","v":{"$error":"#VALUE!"}},null,{"$f":"IF($CK$8=\"\",\"\",$CK$10/$CK$8)","v":""}]
[null,null,null,null,null,null,null,null,null,null,null,null,null,null,null,null,null,null,null,null,null,"DIET CHECK",null,null,null,null,"per cow",null,null,null,null,null,null,null,null,null,null,null,null,null,null,null,null,null,null,null,null,null,null,null,"CRUDE PROTEIN ",null,null,null,null,null,null,null,null,null,null,"MINERALS",null,null,null,null,null,"DCAD EATEN ",null,null,null,null,null,null,null,null,"milk production",{"$f":"IF(AND($BZ$10=1,$BZ$9=\"j\"),81,IF(AND($BZ$10=2,$BZ$9=\"j\"),77,IF(AND($BZ$10=3,$BZ$9=\"j\"),74,IF(AND($BZ$10=1,$BZ$9=\"x\"),84,IF(AND($BZ$10=2,$BZ$9=\"x\"),80,IF(AND($BZ$10=3,$BZ$9=\"x\"),77,IF(AND($BZ$10=1,$BZ$9=\"f\"),86,IF(AND($BZ$10=2,$BZ$9=\"f\"),82,IF(AND($BZ$10=3,$BZ$9=\"f\"),79,\"\")))))))))","v":{"$error":"#VALUE!"}},{"$error":"#VALUE!"},null,"Bypass",null,0.35,0.35]
[null,"PASTURE QUALITY & ALLOCATION",null,null,null,null,null,null,null,"MJME",null," adjust MJME? ",null,null,null,null,null,null,null,null,null,null,null,null,null,"DM","@MJME","MJME",null,null,"PROTEIN",null,null,"NDF",null,null,"SSS",null,null,"STARCH",null,null,"FAT",null,"$/Cow per day",null,"$/Mob per day",null,null,null,null,"UDP",null,"Soluable",null,"RDP",null,null,null,"Na","K","Cl","S","Mg","P",null,"meq/100g DM",null,null,null,null,null,null,null,null,null,"pregnancy",{"$f":"IF($BZ$11>=12,0,IF(AND($BZ$11<=2,$BZ$9=\"j\"),40,IF(AND($BZ$11<=4,$BZ$9=\"j\"),30,IF(AND($BZ$11<=8,$BZ$9=\"j\"),17,IF(AND($BZ$11<=12,$BZ$9=\"j\"),10,IF(AND($BZ$11<=2,$BZ$9=\"x\"),45,IF(AND($BZ$11<=4,$BZ$9=\"x\"),35,IF(AND($BZ$11<=8,$BZ$9=\"x\"),20,IF(AND($BZ$11<=12,$BZ$9=\"x\"),11,IF(AND($BZ$11<=2,$BZ$9=\"f\"),51,IF(AND($BZ$11<=4,$BZ$9=\"f\"),39,IF(AND($BZ$11<=8,$BZ$9=\"f\"),22,IF(AND($BZ$11<=12,$BZ$9=\"f\"),12,)))))))))))))","v":22},22,null,"Soluble",null,0.32,0.32]
[null,null,"Pasture quality",null,null,null,"Pasture autumn and winter",null,null,{"$f":"IF(G14=\"-\",\"\",VLOOKUP(G14,'Data source'!$B$4:$I$12,3,FALSE))","v":{"$error":"#N/A"}},null,null,null,null,null,null,null,null,null,null,null,"RECOMMENDED",null,null,null,{"$f":"IF($J$53=\"Yes\",CI9,\"\")","v":""},{"$f":"IF($J$53=\"Yes\",$CI$8,\"\")","v":""},{"$f":"IF($J$53=\"Yes\",$AQ$10,\"\")","v":""},null,null,{"$f":"IF($J$53=\"Yes\",$BZ$8,\"\")","v":""},null,null,{"$f":"IF($J$53=\"Yes\",\">35\",\"\")","v":""},null,null,{"$f":"IF($J$53=\"Yes\",\"<38\",\"\")","v":""},null,null,{"$f":"IF($J$53=\"Yes\",\"<30\",\"\")","v":""},null,null,{"$f":"IF($J$53=\"Yes\",\"<6\",\"\")","v":""},null,null,null,null,null,null,null,null,">35",null,">32",null,"<65",null,null,null,">0.12",">1.2",">0.50",">0.25",">0.30",">0.25, <0.45",null,"<0","closer to -10",null,null,null,null,null,null,null,null,"per kg walked",{"$f":"IF(O8=\"-\",\"\",VLOOKUP($O$8,'Data source'!$B$209:$C$211,2,FALSE))","v":2},2,null,"Degradable",null,0.65,0.65]
[null,null,"Pre-grazing cover ",null,null,null,null,"kg DM/ha"]
[null,null,"Post-grazing residual ",null,null,null,null,"kg DM/ha",null,null,null,null,null,null,null,null,null,null,null,null,null,"FEED OPTION 1",null,null,null,{"$f":"IF($J$53=\"Yes\",$Y$49,\"\")","v":""},{"$f":"IF($J$53=\"Yes\",$CI$8,\"\")","v":""},{"$f":"IF($J$53=\"Yes\",$AB$49,\"\")","v":""},null,null,{"$f":"IF($J$53=\"Yes\",$AE$49,\"\")","v":""},null,null,{"$f":"IF($J$53=\"Yes\",$AH$49,\"\")","v":""},null,null,{"$f":"IF($J$53=\"Yes\",$AK$49,\"\")","v":""},null,null,{"$f":"IF($J$53=\"Yes\",$AN$49,\"\")","v":""},null,null,{"$f":"IF($J$53=\"Yes\",$AQ$49,\"\")","v":""},null,{"$f":"IF($J$53=\"Yes\",$AV$49,\"\")","v":""},null,{"$f":"IF($J$53=\"Yes\",$AT$49,\"\")","v":""},null,null,null,null,{"$f":"IF($J$53=\"Yes\",$AZ$49,\"\")","v":""},null,{"$f":"IF($J$53=\"Yes\",$BB$49,\"\")","v":""},null,{"$f":"IF($J$53=\"Yes\",$BD$49,\"\")","v":""},null,null,null,{"$f":"BH49","v":""},{"$f":"BI49","v":""},{"$f":"BJ49","v":""},{"$f":"BK49","v":""},{"$f":"BL49","v":""},null,{"$f":"BM49","v":""},{"$f":"IF($J$53=\"Yes\",($BO$49*1000)/($Y$49*10),\"\")","v":""},null,null,null,null,null,null,null,null,null,"YES"]
[null,null,"Hectares grazed/day  -this mob",null,null,null,null,"ha/day",null,null,null,null,null,null,null,null,null,null,null,null,null,null,null,null,"diff",{"$f":"IF($J$53=\"Yes\",$Z$16-$Z$14,\"\")","v":""},null,{"$f":"IF($J$53=\"Yes\",$AB$16-$AB$14,\"\")","v":""},null,null,null,null,null,null,null,null,null,null,null,null,null,null,null,null,null,null,null,null,null,null,null,null,null,null,null,null,null,null,null,null,null,null,null,null,null,null,null,null,null,null,null,null,null,null,null,null,"NO"]
[null,null,null,null,null,null,null,null,null,"Direct input",null,null,null,null,null,null,null,null,null,null,null,"FEED OPTION 2",null,null,null,{"$f":"IF($J$54=\"Yes\",$Y$50,\"\")","v":""},{"$f":"IF(OR($J$53=\"No\",L28<=0),\"\",$CI$8)","v":""},{"$f":"IF($J$54=\"Yes\",$AB$50,\"\")","v":""},null,null,{"$f":"IF($J$54=\"Yes\",$AE$50,\"\")","v":""},null,null,{"$f":"IF($J$54=\"Yes\",$AH$50,\"\")","v":""},null,null,{"$f":"IF($J$54=\"Yes\",$AK$50,\"\")","v":""},null,null,{"$f":"IF($J$54=\"Yes\",$AN$50,\"\")","v":""},null,null,{"$f":"IF($J$54=\"Yes\",$AQ$50,\"\")","v":""},null,{"$f":"IF($J$54=\"Yes\",$AV$50,\"\")","v":""},null,{"$f":"IF($J$54=\"Yes\",$AT$50,\"\")","v":""},null,null,null,null,{"$f":"IF($J$54=\"Yes\",$AZ$50,\"\")","v":""},null,{"$f":"IF($J$54=\"Yes\",$BB$50,\"\")","v":""},null,{"$f":"IF($J$54=\"Yes\",$BD$50,0)","v":0},null,null,null,{"$f":"BH50","v":""},{"$f":"BI50","v":""},{"$f":"BJ50","v":""},{"$f":"BK50","v":""},{"$f":"BL50","v":""},null,{"$f":"BM50","v":""},{"$f":"IF(AND($J$54=\"No\",$AA$6=\"NO\"),0,($BO$50*1000)/($Y$50*10))","v":{"$error":"#VALUE!"}}]
[null,null,"Allocation per day ",null,null,null,{"$f":"IF(OR(G15=\"\",G16=\"\",G17=\"\",O6=\"\"),\"\",((G15-G16)*G17)/O6)","v":""},"kg DM/cow",null,12,"kg DM/cow",null,null,null,null,null,null,null,null,null,null,null,null,null,"diff",{"$f":"IF($J$54=\"Yes\",$Z$18-$Z$14,\"\")","v":""},null,{"$f":"IF($J$54=\"Yes\",$AB$18-$AB$14,\"\")","v":""}]
[]
[null,null,null,null,null,null,null,null,null,null,null,null,null,null,null,null,null,{"$f":"IF(L14>0,L14,J14)","v":{"$error":"#N/A"}}]
[]
[null,"ENERGY SUPPLY",null,null,null,null,null,null,null,"ALLOCATION",null,"ALLOCATION",null,null,null,null,null,null,null,null,null,null,null,null,null,"ENERGY",null,null,null,null,null,null,null,null,null,"COMPOSITION",null,null,null,null,null,null,null,null,"COST OF FEED",null,null,null,null,null,"CRUDE PROTEIN BREAKDOWN",null,null,null,null,null,null,null,null,"MINERALS"]
[null,null,null,null,null,null,null,null,null,"OPTION 1",null,"OPTION 2",null,null,"Feed cost",null,null,null,null,null,null,null,null,null,null,null,null,"ME",null,"Crude protein",null,null,"NDF",null,null,"SSS",null,null,"Starch",null,null,"Fat",null,null,"Wt","Eaten","Eaten","Cost",null,null,null,"UDP",null,"Soluable",null,"RDP",null,null,null,"Na","K","Cl","S","Mg","Ca","P","DCAD"]
[null,null,"FEED TYPE",null,"FEED",null,"FEEDING METHOD",null,null,"Kg DM/cow",null,"KgDM/cow",null,null,"$/tonne",null,null,null,null,null,null,null,null,"Util.","Eaten","ME","DM%","in diet",null,"% DM","% diet",null,"% DM","% diet",null,"% DM","% diet",null,"% S","% diet",null,"% DM","% diet",null,"Wet/Dry","c/kg DM","c/MJ ME","$/Cow",null,null,null,"% DM",null,"% DM",null,"% DM",null,null,null,"%DM","%DM","%DM","%DM","%DM","%DM","%DM"," meq/100g DM",null,null,null,null,null,null,null,null,null,null,"UDP","Sol.","RDP"]
[]
[null,null,"PASTURE",null,{"$f":"$G$14","v":"Pasture autumn and winter"},null,"-",null,null,{"$f":"IF(J19=\"\",G19,J19)","v":12},null,null,null,null,null,null,null,{"$f":"IF(OR($C27=\"-\",$G27=\"-\",$J27<=0,$J$53=\"No\"),\"\",$J27)","v":""},{"$f":"IF(OR($C27=\"-\",$G27=\"-\",$J$53=\"No\"),0,1)","v":0},null,null,{"$f":"E27","v":"Pasture autumn and winter"},"Opt.1",{"$f":"IF(OR($E27=\"-\",$G27=\"-\",$J27=\"\",$J$53=\"No\"),\"\",VLOOKUP($G27,'Data source'!$B$122:$C$124,2,FALSE))","v":""},{"$f":"IF(OR($E27=\"-\",$G27=\"-\",$J27=\"\",$J$53=\"No\"),\"\",J27*X27)","v":""},{"$f":"IF(OR($E27=\"-\",$G27=\"-\",$J27=\"\",$J$53=\"No\"),\"\",$R$21)","v":""},{"$f":"IF(OR($E27=\"-\",$G27=\"-\",$J27=\"\",$J$53=\"No\"),\"\",VLOOKUP($E27,'Data source'!$B$4:$I$12,2,FALSE))","v":""},{"$f":"IF(OR($E27=\"-\",$G27=\"-\",$J27=\"\",$J$53=\"No\"),\"\",Y27*Z27)","v":""},null,{"$f":"IF(OR($E27=\"-\",$G27=\"-\",$J27=\"\",$J$53=\"No\"),\"\",VLOOKUP($E27,'Data source'!$B$4:$I$12,4,FALSE))","v":""},{"$f":"IF(OR($E27=\"-\",$G27=\"-\",$J27=\"\",$J$53=\"No\"),\"\",(($Y27/$Y$49)*AD27))","v":""},null,{"$f":"IF(OR($E27=\"-\",$G27=\"-\",$J27=\"\",$J$53=\"No\"),\"\",VLOOKUP($E27,'Data source'!$B$4:$I$12,5,FALSE))","v":""},{"$f":"IF(OR($E27=\"-\",$G27=\"-\",$J27=\"\",$J$53=\"No\"),\"\",(($Y27/$Y$49)*AG27))","v":""},null,{"$f":"IF(OR($E27=\"-\",$G27=\"-\",$J27=\"\",$J$53=\"No\"),\"\",VLOOKUP($E27,'Data source'!$B$4:$I$12,6,FALSE))","v":""},{"$f":"IF(OR($E27=\"-\",$G27=\"-\",$J27=\"\",$J$53=\"No\"),\"\",(($Y27/$Y$49)*AJ27))","v":""},null,{"$f":"IF(OR($E27=\"-\",$G27=\"-\",$J27=\"\",$J$53=\"No\"),\"\",VLOOKUP($E27,'Data source'!$B$4:$I$12,7,FALSE))","v":""},{"$f":"IF(OR($E27=\"-\",$G27=\"-\",$J27=\"\",$J$53=\"No\"),\"\",(($Y27/$Y$49)*AM27))","v":""},null,{"$f":"IF(OR($E27=\"-\",$G27=\"-\",$J27=\"\",$J$53=\"No\"),\"\",VLOOKUP($E27,'Data source'!$B$4:$I$12,8,FALSE))","v":""},{"$f":"IF(OR($E27=\"-\",$G27=\"-\",$J27=\"\",$J$53=\"No\"),\"\",(AP27/100*AN27)*($Y27/$Y$49))","v":""},null,{"$f":"IF(OR($E27=\"-\",$G27=\"-\",$J27=\"\",$J$53=\"No\"),\"\",VLOOKUP($E27,'Data source'!$B$4:$M$12,12,FALSE))","v":""},{"$f":"IF(OR($E27=\"-\",$G27=\"-\",$J27=\"\",$J$53=\"No\"),\"\",IF($AS27=\"Dry\",$O27/$X27/10,IF($AS27=\"Wet\",$O27/($AA27/100)*$X27/10,0)))","v":""},{"$f":"IF(OR($E27=\"-\",$G27=\"-\",$J27=\"\",$J$53=\"No\"),\"\",AT27/Z27)","v":""},{"$f":"IF(OR($E27=\"-\",$G27=\"-\",$J27=\"\",$J$53=\"No\"),\"\",($AT27*$J27)/100)","v":""},null,null,null,{"$f":"IF(OR($E27=\"-\",$G27=\"-\",$J27=\"\",$J$53=\"No\",$AA$8=\"No\"),\"\",VLOOKUP($E27,'Data source'!$B$4:$M$12,9,FALSE))","v":""},null,{"$f":"IF(OR($E27=\"-\",$G27=\"-\",$J27<=\"\",$J$53=\"No\",$AA$8=\"No\"),\"\",VLOOKUP($E27,'Data source'!$B$4:$M$12,10,FALSE))","v":""},null,{"$f":"IF(OR($E27=\"-\",$G27=\"-\",$J27=\"\",$J$53=\"No\",$AA$8=\"No\"),\"\",VLOOKUP($E27,'Data source'!$B$4:$M$12,11,FALSE))","v":""},null,null,null,{"$f":"IF(OR($E27=\"-\",$G27=\"-\",$J27=\"\",$J$53=\"No\"),0,VLOOKUP($E27,'Data source'!$B$4:$T$12,13,FALSE))","v":0},{"$f":"IF(OR($E27=\"-\",$G27=\"-\",$J27=\"\",$J$53=\"No\"),0,VLOOKUP($E27,'Data source'!$B$4:$T$12,14,FALSE))","v":0},{"$f":"IF(OR($E27=\"-\",$G27=\"-\",$J27=\"\",$J$53=\"No\"),0,VLOOKUP($E27,'Data source'!$B$4:$T$12,15,FALSE))","v":0},{"$f":"IF(OR($E27=\"-\",$G27=\"-\",$J27=\"\",$J$53=\"No\"),0,VLOOKUP($E27,'Data source'!$B$4:$T$12,16,FALSE))","v":0},{"$f":"IF(OR($E27=\"-\",$G27=\"-\",$J27=\"\",$J$53=\"No\"),0,VLOOKUP($E27,'Data source'!$B$4:$T$12,17,FALSE))","v":0},{"$f":"IF(OR($E27=\"-\",$G27=\"-\",$J27=\"\",$J$53=\"No\"),0,VLOOKUP($E27,'Data source'!$B$4:$T$12,18,FALSE))","v":0},{"$f":"IF(OR($E27=\"-\",$G27=\"-\",$J27=\"\",$J$53=\"No\"),0,VLOOKUP($E27,'Data source'!$B$4:$T$12,19,FALSE))","v":0},{"$f":"IF(OR($E27=\"-\",$G27=\"-\",$J27=\"\",$J$53=\"No\"),0,(((43.498*$BH27)+(25.574*$BI27))-((28.206*$BJ27)+(62.375*$BK27)))*$Y27*10/1000)","v":0},null,null,null,null,null,null,null,null,null,null,{"$f":"IF($AZ27=\"\",0,$AZ27*$AE27)","v":0},{"$f":"IF($BB27=\"\",0,$BB27*$AE27)","v":0},{"$f":"IF($BD27=\"\",0,$BD27*$AE27)","v":0}]
[null,null,null,null,null,null,null,null,null,null,null,null,null,null,null,null,null,{"$f":"IF(OR($C27=\"-\",$G27=\"-\",$L28<=0,$J$54=\"No\"),\"\",$L28)","v":""},null,null,null,null,"Opt.2",{"$f":"IF(OR($E27=\"-\",$G27=\"-\",$L28<=0,$J$54=\"No\",$AA$6=\"NO\"),\"\",VLOOKUP($G27,'Data source'!$B$122:$C$124,2,FALSE))","v":""},{"$f":"IF(OR($E27=\"-\",$G27=\"-\",$L28<=0,$J$54=\"No\",$AA$6=\"NO\"),0,$L28*$X28)","v":0},{"$f":"IF(OR($E27=\"-\",$G27=\"-\",$L28<=0,$J$54=\"No\",$AA$6=\"NO\"),\"\",$R$21)","v":""},{"$f":"IF(OR($E27=\"-\",$G27=\"-\",$L28<=0,$J$54=\"No\",$AA$6=\"NO\"),\"\",VLOOKUP($E$27,'Data source'!$B$4:$I$12,2,FALSE))","v":""},{"$f":"IF(OR($E27=\"-\",$G27=\"-\",$L28<=0,$J$54=\"No\",$AA$6=\"NO\"),\"\",$Y28*$Z28)","v":""},null,{"$f":"IF(OR($E27=\"-\",$G27=\"-\",$L28<=0,$J$54=\"No\",$AA$6=\"NO\"),\"\",VLOOKUP($E$27,'Data source'!$B$4:$I$12,4,FALSE))","v":""},{"$f":"IF(OR($E27=\"-\",$G27=\"-\",$L28<=0,$J$54=\"No\",$AA$6=\"NO\"),\"\",(($Y28/$Y$50)*$AD28))","v":""},null,{"$f":"IF(OR($E27=\"-\",$G27=\"-\",$L28<=0,$J$54=\"No\",$AA$6=\"NO\"),\"\",VLOOKUP($E$27,'Data source'!$B$4:$I$12,5,FALSE))","v":""},{"$f":"IF(OR($E27=\"-\",$G27=\"-\",$L28<=0,$J$54=\"No\",$AA$6=\"NO\"),\"\",(($Y28/$Y$50)*AG28))","v":""},null,{"$f":"IF(OR($E27=\"-\",$G27=\"-\",$L28<=0,$J$54=\"No\",$AA$6=\"NO\"),\"\",VLOOKUP($E$27,'Data source'!$B$4:$I$12,6,FALSE))","v":""},{"$f":"IF(OR($E7=\"-\",$G27=\"-\",$L28<=0,$J$54=\"No\",$AA$6=\"NO\"),\"\",(($Y28/$Y$50)*AJ28))","v":""},null,{"$f":"IF(OR($E27=\"-\",$G27=\"-\",$L28<=0,$J$54=\"No\",$AA$6=\"NO\"),\"\",VLOOKUP($E$27,'Data source'!$B$4:$I$12,7,FALSE))","v":""},{"$f":"IF(OR($E27=\"-\",$G27=\"-\",$L28<=0,$J$54=\"No\",$AA$6=\"NO\"),\"\",(($Y28/$Y$50)*AM28))","v":""},null,{"$f":"IF(OR($E27=\"-\",$G27=\"-\",$L28<=0,$J$54=\"No\",$AA$6=\"NO\"),\"\",VLOOKUP($E$27,'Data source'!$B$4:$I$12,8,FALSE))","v":""},{"$f":"IF(OR($E27=\"-\",$G27=\"-\",$L28<=0,$J$54=\"No\",$AA$6=\"NO\"),\"\",(AP28/100*AN28)*($Y28/$Y$50))","v":""},null,{"$f":"IF(OR($E27=\"-\",$G27=\"-\",$L28<=0,$J$55=\"No\",$AA$6=\"NO\"),\"\",VLOOKUP($E27,'Data source'!$B$4:$M$12,12,FALSE))","v":""},{"$f":"IF(OR($E27=\"-\",$G27=\"-\",$L28<=0,$J$55=\"No\",$AA$6=\"NO\"),\"\",IF($AS28=\"Dry\",$O27/$X28/10,IF($AS28=\"Wet\",$O27/($AA28/100)*$X28/10,0)))","v":""},{"$f":"IF(OR($E27=\"-\",$G27=\"-\",$L28<=0,$J$55=\"No\",$AA$6=\"NO\"),\"\",AT28/Z28)","v":""},{"$f":"IF(OR($E27=\"-\",$G27=\"-\",$L28<=0,$J$55=\"No\",$AA$6=\"NO\"),\"\",($AT28*$L28)/100)","v":""},null,null,null,{"$f":"IF(OR($E27=\"-\",$G27=\"-\",$L28<=0,$J$54=\"No\",$AA$6=\"NO\"),\"\",VLOOKUP($E27,'Data source'!$B$4:$M$12,9,FALSE))","v":""},null,{"$f":"IF(OR($E27=\"-\",$G27=\"-\",$L28<=0,$J$54=\"No\",$AA$6=\"NO\"),\"\",VLOOKUP($E27,'Data source'!$B$4:$M$12,10,FALSE))","v":""},null,{"$f":"IF(OR($E27=\"-\",$G27=\"-\",$L28<=0,$J$54=\"No\",$AA$6=\"NO\"),\"\",VLOOKUP($E27,'Data source'!$B$4:$M$12,11,FALSE))","v":""},null,null,null,{"$f":"IF(OR($E27=\"-\",$G27=\"-\",$L28<=0,$J$54=\"No\",$AA$6=\"NO\"),0,VLOOKUP($E$27,'Data source'!$B$4:$T$12,13,FALSE))","v":0},{"$f":"IF(OR($E27=\"-\",$G27=\"-\",$L28<=0,$J$54=\"No\",$AA$6=\"NO\"),0,VLOOKUP($E$27,'Data source'!$B$4:$T$12,14,FALSE))","v":0},{"$f":"IF(OR($E27=\"-\",$G27=\"-\",$L28<=0,$J$54=\"No\",$AA$6=\"NO\"),0,VLOOKUP($E$27,'Data source'!$B$4:$T$12,15,FALSE))","v":0},{"$f":"IF(OR($E27=\"-\",$G27=\"-\",$L28<=0,$J$54=\"No\",$AA$6=\"NO\"),0,VLOOKUP($E$27,'Data source'!$B$4:$T$12,16,FALSE))","v":0},{"$f":"IF(OR($E27=\"-\",$G27=\"-\",$L28<=0,$J$54=\"No\",$AA$6=\"NO\"),0,VLOOKUP($E$27,'Data source'!$B$4:$T$12,17,FALSE))","v":0},{"$f":"IF(OR($E27=\"-\",$G27=\"-\",$L28<=0,$J$54=\"No\",$AA$6=\"NO\"),0,VLOOKUP($E$27,'Data source'!$B$4:$T$12,18,FALSE))","v":0},{"$f":"IF(OR($E27=\"-\",$G27=\"-\",$L28<=0,$J$54=\"No\",$AA$6=\"NO\"),0,VLOOKUP($E$27,'Data source'!$B$4:$T$12,19,FALSE))","v":0},{"$f":"IF(OR($E27=\"-\",$G27=\"-\",$L28<=0,$J$54=\"No\",$AA$6=\"NO\"),0,((43.498*$BH28)+(25.574*$BI28))-((28.206*$BJ28)+(62.375*$BK28)))*$Y28*10/1000","v":0},null,null,null,null,null,null,null,null,null,null,{"$f":"IF($AZ28=\"\",0,$AZ28*$AE28)","v":0},{"$f":"IF($BB28=\"\",0,$BB28*$AE28)","v":0},{"$f":"IF($BD28=\"\",0,$BD28*$AE28)","v":0}]
[]
[null,null,{"$f":"IF('   ASK    '!W8=\"\",\"\",'   ASK    '!W8)","v":"Hay_Silage"},null,{"$f":"IF('   ASK    '!Y8=\"\",\"\",'   ASK    '!Y8)","v":"Hay pasture good"},null,"-",null,null,null,null,null,null,null,null,null,null,{"$f":"IF(OR($E30=\"-\",$G30=\"-\",$J30<=0,$J$53=\"No\"),\"\",$J30)","v":""},{"$f":"IF(OR($E30=\"-\",$G30=\"-\",$J$53=\"No\"),0,1)","v":0},null,null,{"$f":"E30","v":"Hay pasture good"},"Opt.1",{"$f":"IF(OR($E30=\"-\",$G30=\"-\",$J30<=0,$J$53=\"No\"),\"\",VLOOKUP($G30,'Data source'!$B$128:$C$137,2,FALSE))","v":""},{"$f":"IF(OR($E30=\"-\",$G30=\"-\",$J30<=0,$J$53=\"No\"),0,J30*X30)","v":0},{"$f":"IF(OR($E30=\"-\",$G30=\"-\",$J30<=0,$J$53=\"No\"),\"\",$R$21)","v":""},{"$f":"IF(OR($E30=\"-\",$G30=\"-\",$J30<=0,$J$53=\"No\"),\"\",VLOOKUP($E30,'Data source'!$B$15:$I$99,2,FALSE))","v":""},{"$f":"IF(OR($E30=\"-\",$G30=\"-\",$J30<=0,$J$53=\"No\"),\"\",Y30*Z30)","v":""},null,{"$f":"IF(OR($E30=\"-\",$G30=\"-\",$J30<=0,$J$53=\"No\"),\"\",VLOOKUP($E30,'Data source'!$B$15:$I$99,4,FALSE))","v":""},{"$f":"IF(OR($E30=\"-\",$G30=\"-\",$J30<=0,$J$53=\"No\"),\"\",(($Y30/$Y$49)*AD30))","v":""},null,{"$f":"IF(OR($E30=\"-\",$G30=\"-\",$J30<=0,$J$53=\"No\"),\"\",VLOOKUP($E30,'Data source'!$B$15:$I$99,5,FALSE))","v":""},{"$f":"IF(OR($E30=\"-\",$G30=\"-\",$J30<=0,$J$53=\"No\"),\"\",(($Y30/$Y$49)*AG30))","v":""},null,{"$f":"IF(OR($E30=\"-\",$G30=\"-\",$J30<=0,$J$53=\"No\"),\"\",VLOOKUP($E30,'Data source'!$B$15:$I$99,6,FALSE))","v":""},{"$f":"IF(OR($E30=\"-\",$G30=\"-\",$J30<=0,$J$53=\"No\"),\"\",(($Y30/$Y$49)*AJ30))","v":""},null,{"$f":"IF(OR($E30=\"-\",$G30=\"-\",$J30<=0,$J$53=\"No\"),\"\",VLOOKUP($E30,'Data source'!$B$15:$I$99,7,FALSE))","v":""},{"$f":"IF(OR($E30=\"-\",$G30=\"-\",$J30<=0,$J$53=\"No\"),\"\",(($Y30/$Y$49)*AM30))","v":""},null,{"$f":"IF(OR($E30=\"-\",$G30=\"-\",$J30<=0,$J$53=\"No\"),\"\",VLOOKUP($E30,'Data source'!$B$15:$I$99,8,FALSE))","v":""},{"$f":"IF(OR($E30=\"-\",$G30=\"-\",$J30=\"\",$J$53=\"No\"),\"\",(AP30/100*AN30)*($Y30/$Y$49))","v":""},null,{"$f":"IF(OR($E30=\"-\",$G30=\"-\",$J30<=0,$J$53=\"No\"),\"\",VLOOKUP($E30,'Data source'!$B$15:$M$99,12,FALSE))","v":""},{"$f":"IF(OR($E30=\"-\",$G30=\"-\",$J30<=0,$J$53=\"No\"),\"\",IF($AS30=\"Dry\",$O30/$X30/10,IF($AS30=\"Wet\",$O30/($AA30/100)*$X30/10,0)))","v":""},{"$f":"IF(OR($E30=\"-\",$G30=\"-\",$J30<=0,$J$53=\"No\"),\"\",AT30/Z30)","v":""},{"$f":"IF(OR($E30=\"-\",$G30=\"-\",$J30<=0,$J$53=\"No\"),\"\",($AT30*$J30)/100)","v":""},null,null,null,{"$f":"IF(OR($E30=\"-\",$G30=\"-\",$J30<=0,$J$53=\"No\"),\"\",VLOOKUP($E30,'Data source'!$B$12:$M$99,9,FALSE))","v":""},null,{"$f":"IF(OR($E30=\"-\",$G30=\"-\",$J30<=0,$J$53=\"No\"),\"\",VLOOKUP($E30,'Data source'!$B$12:$M$99,10,FALSE))","v":""},null,{"$f":"IF(OR($E30=\"-\",$G30=\"-\",$J30<=0,$J$53=\"No\"),\"\",VLOOKUP($E30,'Data source'!$B$12:$M$99,11,FALSE))","v":""},null,null,null,{"$f":"IF(OR($E30=\"-\",$G30=\"-\",$J30<=0,$J$53=\"No\"),0,VLOOKUP($E30,'Data source'!$B$15:$T$99,13,FALSE))","v":0},{"$f":"IF(OR($E30=\"-\",$G30=\"-\",$J30<=0,$J$53=\"No\"),0,VLOOKUP($E30,'Data source'!$B$15:$T$99,14,FALSE))","v":0},{"$f":"IF(OR($E30=\"-\",$G30=\"-\",$J30<=0,$J$53=\"No\"),0,VLOOKUP($E30,'Data source'!$B$15:$T$99,15,FALSE))","v":0},{"$f":"IF(OR($E30=\"-\",$G30=\"-\",$J30<=0,$J$53=\"No\"),0,VLOOKUP($E30,'Data source'!$B$15:$T$99,16,FALSE))","v":0},{"$f":"IF(OR($E30=\"-\",$G30=\"-\",$J30<=0,$J$53=\"No\"),0,VLOOKUP($E30,'Data source'!$B$15:$T$99,17,FALSE))","v":0},{"$f":"IF(OR($E30=\"-\",$G30=\"-\",$J30<=0,$J$53=\"No\"),0,VLOOKUP($E30,'Data source'!$B$15:$T$99,18,FALSE))","v":0},{"$f":"IF(OR($E30=\"-\",$G30=\"-\",$J30<=0,$J$53=\"No\"),0,VLOOKUP($E30,'Data source'!$B$15:$T$99,19,FALSE))","v":0},{"$f":"IF(OR($E30=\"-\",$G30=\"-\",$J30<=0,$J$53=\"No\"),0,((43.498*$BH30)+(25.574*$BI30))-((28.206*$BJ30)+(62.375*$BK30)))*$Y30*10/1000","v":0},null,null,null,null,null,null,null,null,null,null,{"$f":"IF($AZ30=\"\",0,$AZ30*$AE30)","v":0},{"$f":"IF($BB30=\"\",0,$BB30*$AE30)","v":0},{"$f":"IF($BD30=\"\",0,$BD30*$AE30)","v":0}]
[null,null,null,null,null,null,null,null,null,null,null,null,null,null,null,null,null,{"$f":"IF(OR($E30=\"-\",$G30=\"-\",$L31<=0,$J$54=\"No\"),\"\",$L31)","v":""},null,null,null,null,"Opt.2",{"$f":"IF(OR($E30=\"-\",$G30=\"-\",$L31<=0,$J$54=\"No\",$AA$6=\"NO\"),\"\",VLOOKUP($G30,'Data source'!$B$128:$C$137,2,FALSE))","v":""},{"$f":"IF(OR($E30=\"-\",$G30=\"-\",$L31<=0,$J$54=\"No\",$AA$6=\"NO\"),0,$L31*$X31)","v":0},{"$f":"IF(OR($E30=\"-\",$G30=\"-\",$L31<=0,$J$54=\"No\",$AA$6=\"NO\"),\"\",$R$21)","v":""},{"$f":"IF(OR($E30=\"-\",$G30=\"-\",$L31<=0,$J$54=\"No\",$AA$6=\"NO\"),\"\",VLOOKUP($E30,'Data source'!$B$12:$I$99,2,FALSE))","v":""},{"$f":"IF(OR($E30=\"-\",$G30=\"-\",$L31<=0,$J$54=\"No\",$AA$6=\"NO\"),\"\",$Y31*$Z31)","v":""},null,{"$f":"IF(OR($E30=\"-\",$G30=\"-\",$L31<=0,$J$54=\"No\",$AA$6=\"NO\"),\"\",VLOOKUP($E30,'Data source'!$B$12:$I$99,4,FALSE))","v":""},{"$f":"IF(OR($E30=\"-\",$G30=\"-\",$L31<=0,$J$54=\"No\",$AA$6=\"NO\"),\"\",(($Y31/$Y$50)*$AD31))","v":""},null,{"$f":"IF(OR($E30=\"-\",$G30=\"-\",$L31<=0,$J$54=\"No\",$AA$6=\"NO\"),\"\",VLOOKUP($E30,'Data source'!$B$12:$I$99,5,FALSE))","v":""},{"$f":"IF(OR($E30=\"-\",$G30=\"-\",$L31<=0,$J$54=\"No\",$AA$6=\"NO\"),\"\",(($Y31/$Y$50)*AG31))","v":""},null,{"$f":"IF(OR($E30=\"-\",$G30=\"-\",$L31<=0,$J$54=\"No\",$AA$6=\"NO\"),\"\",VLOOKUP($E30,'Data source'!$B$12:$I$99,6,FALSE))","v":""},{"$f":"IF(OR($E30=\"-\",$G30=\"-\",$L31<=0,$J$54=\"No\",$AA$6=\"NO\"),\"\",(($Y31/$Y$50)*AJ31))","v":""},null,{"$f":"IF(OR($E30=\"-\",$G30=\"-\",$L31<=0,$J$54=\"No\",$AA$6=\"NO\"),\"\",VLOOKUP($E30,'Data source'!$B$12:$I$99,7,FALSE))","v":""},{"$f":"IF(OR($E30=\"-\",$G30=\"-\",$L31<=0,$J$54=\"No\",$AA$6=\"NO\"),\"\",(($Y31/$Y$50)*AM31))","v":""},null,{"$f":"IF(OR($E30=\"-\",$G30=\"-\",$L31<=0,$J$54=\"No\",$AA$6=\"NO\"),\"\",VLOOKUP($E30,'Data source'!$B$12:$I$99,8,FALSE))","v":""},{"$f":"IF(OR($E30=\"-\",$G30=\"-\",$L31<=0,$J$54=\"No\",$AA$6=\"NO\"),\"\",(AP31/100*AN31)*($Y31/$Y$50))","v":""},null,{"$f":"IF(OR($E30=\"-\",$G30=\"-\",$L31<=0,$J$54=\"No\",$AA$6=\"NO\"),\"\",VLOOKUP($E30,'Data source'!$B$15:$M$99,12,FALSE))","v":""},{"$f":"IF(OR($E30=\"-\",$G30=\"-\",$L31<=0,$J$54=\"No\",$AA$6=\"NO\"),\"\",IF($AS31=\"Dry\",$O30/$X31/10,IF($AS31=\"Wet\",$O30/($AA31/100)*$X31/10,0)))","v":""},{"$f":"IF(OR($E30=\"-\",$G30=\"-\",$L31<=0,$J$54=\"No\",$AA$6=\"NO\"),\"\",IF(OR($H17=\"-\",$Q31=\"-\",$L31=0),\"\",AT31/Z31))","v":""},{"$f":"IF(OR($E30=\"-\",$G30=\"-\",$L31<=0,$J$54=\"No\",$AA$6=\"NO\"),\"\",IF(OR($H17=\"-\",$Q31=\"-\",$L31=0),\"\",($AT31*$L31)/100))","v":""},null,null,null,{"$f":"IF(OR($E30=\"-\",$G30=\"-\",$L31<=0,$J$54=\"No\",$AA$6=\"NO\"),\"\",VLOOKUP($E30,'Data source'!$B$15:$M$99,9,FALSE))","v":""},null,{"$f":"IF(OR($E30=\"-\",$G30=\"-\",$L31<=0,$J$54=\"No\",$AA$6=\"NO\"),\"\",VLOOKUP($E30,'Data source'!$B$15:$M$99,10,FALSE))","v":""},null,{"$f":"IF(OR($E30=\"-\",$G30=\"-\",$L31<=0,$J$54=\"No\",$AA$6=\"NO\"),\"\",VLOOKUP($E30,'Data source'!$B$15:$M$99,11,FALSE))","v":""},null,null,null,{"$f":"IF(OR($E30=\"-\",$G30=\"-\",$L31<=0,$J$54=\"No\",$AA$6=\"NO\"),0,VLOOKUP($E30,'Data source'!$B$15:$T$99,13,FALSE))","v":0},{"$f":"IF(OR($E30=\"-\",$G30=\"-\",$L31<=0,$J$54=\"No\",$AA$6=\"NO\"),0,VLOOKUP($E30,'Data source'!$B$15:$T$99,14,FALSE))","v":0},{"$f":"IF(OR($E30=\"-\",$G30=\"-\",$L31<=0,$J$54=\"No\",$AA$6=\"NO\"),0,VLOOKUP($E30,'Data source'!$B$15:$T$99,15,FALSE))","v":0},{"$f":"IF(OR($E30=\"-\",$G30=\"-\",$L31<=0,$J$54=\"No\",$AA$6=\"NO\"),0,VLOOKUP($E30,'Data source'!$B$15:$T$99,16,FALSE))","v":0},{"$f":"IF(OR($E30=\"-\",$G30=\"-\",$L31<=0,$J$54=\"No\",$AA$6=\"NO\"),0,VLOOKUP($E30,'Data source'!$B$15:$T$99,17,FALSE))","v":0},{"$f":"IF(OR($E30=\"-\",$G30=\"-\",$L31<=0,$J$54=\"No\",$AA$6=\"NO\"),0,VLOOKUP($E30,'Data source'!$B$15:$T$99,18,FALSE))","v":0},{"$f":"IF(OR($E30=\"-\",$G30=\"-\",$L31<=0,$J$54=\"No\",$AA$6=\"NO\"),0,VLOOKUP($E30,'Data source'!$B$15:$T$99,19,FALSE))","v":0},{"$f":"IF(OR($E30=\"-\",$G30=\"-\",$L31<=0,$J$54=\"No\",$AA$6=\"NO\"),0,((43.498*$BH31)+(25.574*$BI31))-((28.206*$BJ31)+(62.375*$BK31)))*$Y31*10/1000","v":0},null,null,null,null,null,null,null,null,null,null,{"$f":"IF($AZ31=\"\",0,$AZ31*$AE31)","v":0},{"$f":"IF($BB31=\"\",0,$BB31*$AE31)","v":0},{"$f":"IF($BD31=\"\",0,$BD31*$AE31)","v":0}]
[]
[null,null,{"$f":"IF('   ASK    '!W11=\"\",\"\",'   ASK    '!W11)","v":"Concentrates"},null,{"$f":"IF('   ASK    '!Y11=\"\",\"\",'   ASK    '!Y11)","v":"Barley"},null,"-",null,null,null,null,null,null,null,null,null,null,{"$f":"IF(OR($C33=\"-\",$G33=\"-\",$J33<=0,$J$53=\"No\"),\"\",$J33)","v":""},{"$f":"IF(OR($C33=\"-\",$G33=\"-\",$J$53=\"No\"),0,1)","v":0},null,null,{"$f":"C33","v":"Concentrates"},"Opt.1",{"$f":"IF(OR($E33=\"-\",$G33=\"-\",$J33<=0,$J$53=\"No\"),\"\",VLOOKUP($G33,'Data source'!$B$128:$C$137,2,FALSE))","v":""},{"$f":"IF(OR($E33=\"-\",$G33=\"-\",$J33<=0,$J$53=\"No\"),0,J33*X33)","v":0},{"$f":"IF(OR($E33=\"-\",$G33=\"-\",$J33<=0,$J$53=\"No\"),\"\",$R$21)","v":""},{"$f":"IF(OR($E33=\"-\",$G33=\"-\",$J33<=0,$J$53=\"No\"),\"\",VLOOKUP($E33,'Data source'!$B$15:$I$99,2,FALSE))","v":""},{"$f":"IF(OR($E33=\"-\",$G33=\"-\",$J33<=0,$J$53=\"No\"),\"\",Y33*Z33)","v":""},null,{"$f":"IF(OR($E33=\"-\",$G33=\"-\",$J33<=0,$J$53=\"No\"),\"\",VLOOKUP($E33,'Data source'!$B$15:$I$99,4,FALSE))","v":""},{"$f":"IF(OR($E33=\"-\",$G33=\"-\",$J33<=0,$J$53=\"No\"),\"\",(($Y33/$Y$49)*AD33))","v":""},null,{"$f":"IF(OR($E33=\"-\",$G33=\"-\",$J33<=0,$J$53=\"No\"),\"\",VLOOKUP($E33,'Data source'!$B$15:$I$99,5,FALSE))","v":""},{"$f":"IF(OR($E33=\"-\",$G33=\"-\",$J33<=0,$J$53=\"No\"),\"\",(($Y33/$Y$49)*AG33))","v":""},null,{"$f":"IF(OR($E33=\"-\",$G33=\"-\",$J33<=0,$J$53=\"No\"),\"\",VLOOKUP($E33,'Data source'!$B$15:$I$99,6,FALSE))","v":""},{"$f":"IF(OR($E33=\"-\",$G33=\"-\",$J33<=0,$J$53=\"No\"),\"\",(($Y33/$Y$49)*AJ33))","v":""},null,{"$f":"IF(OR($E33=\"-\",$G33=\"-\",$J33<=0,$J$53=\"No\"),\"\",VLOOKUP($E33,'Data source'!$B$15:$I$99,7,FALSE))","v":""},{"$f":"IF(OR($E33=\"-\",$G33=\"-\",$J33<=0,$J$53=\"No\"),\"\",(($Y33/$Y$49)*AM33))","v":""},null,{"$f":"IF(OR($E33=\"-\",$G33=\"-\",$J33<=0,$J$53=\"No\"),\"\",VLOOKUP($E33,'Data source'!$B$15:$I$99,8,FALSE))","v":""},{"$f":"IF(OR($E33=\"-\",$G33=\"-\",$J33=\"\",$J$53=\"No\"),\"\",(AP33/100*AN33)*($Y33/$Y$49))","v":""},null,{"$f":"IF(OR($E33=\"-\",$G33=\"-\",$J33<=0,$J$53=\"No\"),\"\",VLOOKUP($E33,'Data source'!$B$15:$M$99,12,FALSE))","v":""},{"$f":"IF(OR($E33=\"-\",$G33=\"-\",$J33<=0,$J$53=\"No\"),\"\",IF($AS33=\"Dry\",$O33/$X33/10,IF($AS33=\"Wet\",$O33/($AA33/100)*$X33/10,0)))","v":""},{"$f":"IF(OR($E33=\"-\",$G33=\"-\",$J33<=0,$J$53=\"No\"),\"\",AT33/Z33)","v":""},{"$f":"IF(OR($E33=\"-\",$G33=\"-\",$J33<=0,$J$53=\"No\"),\"\",($AT33*$J33)/100)","v":""},null,null,null,{"$f":"IF(OR($E33=\"-\",$G33=\"-\",$J33<=0,$J$53=\"No\"),\"\",VLOOKUP($E33,'Data source'!$B$12:$M$99,9,FALSE))","v":""},null,{"$f":"IF(OR($E33=\"-\",$G33=\"-\",$J33<=0,$J$53=\"No\"),\"\",VLOOKUP($E33,'Data source'!$B$12:$M$99,10,FALSE))","v":""},null,{"$f":"IF(OR($E33=\"-\",$G33=\"-\",$J33<=0,$J$53=\"No\"),\"\",VLOOKUP($E33,'Data source'!$B$12:$M$99,11,FALSE))","v":""},null,null,null,{"$f":"IF(OR($E33=\"-\",$G33=\"-\",$J33<=0,$J$53=\"No\"),0,VLOOKUP($E33,'Data source'!$B$15:$T$99,13,FALSE))","v":0},{"$f":"IF(OR($E33=\"-\",$G33=\"-\",$J33<=0,$J$53=\"No\"),0,VLOOKUP($E33,'Data source'!$B$15:$T$99,14,FALSE))","v":0},{"$f":"IF(OR($E33=\"-\",$G33=\"-\",$J33<=0,$J$53=\"No\"),0,VLOOKUP($E33,'Data source'!$B$15:$T$99,15,FALSE))","v":0},{"$f":"IF(OR($E33=\"-\",$G33=\"-\",$J33<=0,$J$53=\"No\"),0,VLOOKUP($E33,'Data source'!$B$15:$T$99,16,FALSE))","v":0},{"$f":"IF(OR($E33=\"-\",$G33=\"-\",$J33<=0,$J$53=\"No\"),0,VLOOKUP($E33,'Data source'!$B$15:$T$99,17,FALSE))","v":0},{"$f":"IF(OR($E33=\"-\",$G33=\"-\",$J33<=0,$J$53=\"No\"),0,VLOOKUP($E33,'Data source'!$B$15:$T$99,18,FALSE))","v":0},{"$f":"IF(OR($E33=\"-\",$G33=\"-\",$J33<=0,$J$53=\"No\"),0,VLOOKUP($E33,'Data source'!$B$15:$T$99,19,FALSE))","v":0},{"$f":"IF(OR($E33=\"-\",$G33=\"-\",$J33<=0,$J$53=\"No\"),0,((43.498*$BH33)+(25.574*$BI33))-((28.206*$BJ33)+(62.375*$BK33)))*$Y33*10/1000","v":0},null,null,null,null,null,null,null,null,null,null,{"$f":"IF($AZ33=\"\",0,$AZ33*$AE33)","v":0},{"$f":"IF($BB33=\"\",0,$BB33*$AE33)","v":0},{"$f":"IF($BD33=\"\",0,$BD33*$AE33)","v":0}]
[null,null,null,null,null,null,null,null,null,null,null,null,null,null,null,null,null,{"$f":"IF(OR($C33=\"-\",$G33=\"-\",$L34<=0,$J$54=\"No\"),\"\",$L34)","v":""},null,null,null,null,"Opt.2",{"$f":"IF(OR($E33=\"-\",$G33=\"-\",$L34<=0,$J$54=\"No\",$AA$6=\"NO\"),\"\",VLOOKUP($G33,'Data source'!$B$128:$C$137,2,FALSE))","v":""},{"$f":"IF(OR($E33=\"-\",$G33=\"-\",$L34<=0,$J$54=\"No\",$AA$6=\"NO\"),0,$L34*$X34)","v":0},{"$f":"IF(OR($E33=\"-\",$G33=\"-\",$L34<=0,$J$54=\"No\",$AA$6=\"NO\"),\"\",$R$21)","v":""},{"$f":"IF(OR($E33=\"-\",$G33=\"-\",$L34<=0,$J$54=\"No\",$AA$6=\"NO\"),\"\",VLOOKUP($E33,'Data source'!$B$12:$I$99,2,FALSE))","v":""},{"$f":"IF(OR($E33=\"-\",$G33=\"-\",$L34<=0,$J$54=\"No\",$AA$6=\"NO\"),\"\",$Y34*$Z34)","v":""},null,{"$f":"IF(OR($E33=\"-\",$G33=\"-\",$L34<=0,$J$54=\"No\",$AA$6=\"NO\"),\"\",VLOOKUP($E33,'Data source'!$B$12:$I$99,4,FALSE))","v":""},{"$f":"IF(OR($E33=\"-\",$G33=\"-\",$L34<=0,$J$54=\"No\",$AA$6=\"NO\"),\"\",(($Y34/$Y$50)*$AD34))","v":""},null,{"$f":"IF(OR($E33=\"-\",$G33=\"-\",$L34<=0,$J$54=\"No\",$AA$6=\"NO\"),\"\",VLOOKUP($E33,'Data source'!$B$12:$I$99,5,FALSE))","v":""},{"$f":"IF(OR($E33=\"-\",$G33=\"-\",$L34<=0,$J$54=\"No\",$AA$6=\"NO\"),\"\",(($Y34/$Y$50)*AG34))","v":""},null,{"$f":"IF(OR($E33=\"-\",$G33=\"-\",$L34<=0,$J$54=\"No\",$AA$6=\"NO\"),\"\",VLOOKUP($E33,'Data source'!$B$12:$I$99,6,FALSE))","v":""},{"$f":"IF(OR($E33=\"-\",$G33=\"-\",$L34<=0,$J$54=\"No\",$AA$6=\"NO\"),\"\",(($Y34/$Y$50)*AJ34))","v":""},null,{"$f":"IF(OR($E33=\"-\",$G33=\"-\",$L34<=0,$J$54=\"No\",$AA$6=\"NO\"),\"\",VLOOKUP($E33,'Data source'!$B$12:$I$99,7,FALSE))","v":""},{"$f":"IF(OR($E33=\"-\",$G33=\"-\",$L34<=0,$J$54=\"No\",$AA$6=\"NO\"),\"\",(($Y34/$Y$50)*AM34))","v":""},null,{"$f":"IF(OR($E33=\"-\",$G33=\"-\",$L34<=0,$J$54=\"No\",$AA$6=\"NO\"),\"\",VLOOKUP($E33,'Data source'!$B$12:$I$99,8,FALSE))","v":""},{"$f":"IF(OR($E33=\"-\",$G33=\"-\",$L34<=0,$J$54=\"No\",$AA$6=\"NO\"),\"\",(AP34/100*AN34)*($Y34/$Y$50))","v":""},null,{"$f":"IF(OR($E33=\"-\",$G33=\"-\",$L34<=0,$J$54=\"No\",$AA$6=\"NO\"),\"\",VLOOKUP($E33,'Data source'!$B$15:$M$99,12,FALSE))","v":""},{"$f":"IF(OR($E33=\"-\",$G33=\"-\",$L34<=0,$J$54=\"No\",$AA$6=\"NO\"),\"\",IF($AS34=\"Dry\",$O33/$X34/10,IF($AS34=\"Wet\",$O33/($AA34/100)*$X34/10,0)))","v":""},{"$f":"IF(OR($E33=\"-\",$G33=\"-\",$L34<=0,$J$54=\"No\",$AA$6=\"NO\"),\"\",IF(OR($H20=\"-\",$Q34=\"-\",$L34=0),\"\",AT34/Z34))","v":""},{"$f":"IF(OR($E33=\"-\",$G33=\"-\",$L34<=0,$J$54=\"No\",$AA$6=\"NO\"),\"\",IF(OR($H20=\"-\",$Q34=\"-\",$L34=0),\"\",($AT34*$L34)/100))","v":""},null,null,null,{"$f":"IF(OR($E33=\"-\",$G33=\"-\",$L34<=0,$J$54=\"No\",$AA$6=\"NO\"),\"\",VLOOKUP($E33,'Data source'!$B$15:$M$99,9,FALSE))","v":""},null,{"$f":"IF(OR($E33=\"-\",$G33=\"-\",$L34<=0,$J$54=\"No\",$AA$6=\"NO\"),\"\",VLOOKUP($E33,'Data source'!$B$15:$M$99,10,FALSE))","v":""},null,{"$f":"IF(OR($E33=\"-\",$G33=\"-\",$L34<=0,$J$54=\"No\",$AA$6=\"NO\"),\"\",VLOOKUP($E33,'Data source'!$B$15:$M$99,11,FALSE))","v":""},null,null,null,{"$f":"IF(OR($E33=\"-\",$G33=\"-\",$L34<=0,$J$54=\"No\",$AA$6=\"NO\"),0,VLOOKUP($E33,'Data source'!$B$15:$T$99,13,FALSE))","v":0},{"$f":"IF(OR($E33=\"-\",$G33=\"-\",$L34<=0,$J$54=\"No\",$AA$6=\"NO\"),0,VLOOKUP($E33,'Data source'!$B$15:$T$99,14,FALSE))","v":0},{"$f":"IF(OR($E33=\"-\",$G33=\"-\",$L34<=0,$J$54=\"No\",$AA$6=\"NO\"),0,VLOOKUP($E33,'Data source'!$B$15:$T$99,15,FALSE))","v":0},{"$f":"IF(OR($E33=\"-\",$G33=\"-\",$L34<=0,$J$54=\"No\",$AA$6=\"NO\"),0,VLOOKUP($E33,'Data source'!$B$15:$T$99,16,FALSE))","v":0},{"$f":"IF(OR($E33=\"-\",$G33=\"-\",$L34<=0,$J$54=\"No\",$AA$6=\"NO\"),0,VLOOKUP($E33,'Data source'!$B$15:$T$99,17,FALSE))","v":0},{"$f":"IF(OR($E33=\"-\",$G33=\"-\",$L34<=0,$J$54=\"No\",$AA$6=\"NO\"),0,VLOOKUP($E33,'Data source'!$B$15:$T$99,18,FALSE))","v":0},{"$f":"IF(OR($E33=\"-\",$G33=\"-\",$L34<=0,$J$54=\"No\",$AA$6=\"NO\"),0,VLOOKUP($E33,'Data source'!$B$15:$T$99,19,FALSE))","v":0},{"$f":"IF(OR($E33=\"-\",$G33=\"-\",$L34<=0,$J$54=\"No\",$AA$6=\"NO\"),0,((43.498*$BH34)+(25.574*$BI34))-((28.206*$BJ34)+(62.375*$BK34)))*$Y34*10/1000","v":0},null,null,null,null,null,null,null,null,null,null,{"$f":"IF($AZ34=\"\",0,$AZ34*$AE34)","v":0},{"$f":"IF($BB34=\"\",0,$BB34*$AE34)","v":0},{"$f":"IF($BD34=\"\",0,$BD34*$AE34)","v":0}]
[]
[null,null,{"$f":"IF('   ASK    '!W14=\"\",\"\",'   ASK    '!W14)","v":"Forages"},null,{"$f":"IF('   ASK    '!Y14=\"\",\"\",'   ASK    '!Y14)","v":"Chicory"},null,"-",null,null,null,null,null,null,null,null,null,null,{"$f":"IF(OR($C36=\"-\",$G36=\"-\",$J36<=0,$J$53=\"No\"),\"\",$J36)","v":""},{"$f":"IF(OR($C36=\"-\",$G36=\"-\",$J$53=\"No\"),0,1)","v":0},null,null,{"$f":"C36","v":"Forages"},"Opt.1",{"$f":"IF(OR($E36=\"-\",$G36=\"-\",$J36<=0,$J$53=\"No\"),\"\",VLOOKUP($G36,'Data source'!$B$128:$C$137,2,FALSE))","v":""},{"$f":"IF(OR($E36=\"-\",$G36=\"-\",$J36<=0,$J$53=\"No\"),0,J36*X36)","v":0},{"$f":"IF(OR($E36=\"-\",$G36=\"-\",$J36<=0,$J$53=\"No\"),\"\",$R$21)","v":""},{"$f":"IF(OR($E36=\"-\",$G36=\"-\",$J36<=0,$J$53=\"No\"),\"\",VLOOKUP($E36,'Data source'!$B$15:$I$99,2,FALSE))","v":""},{"$f":"IF(OR($E36=\"-\",$G36=\"-\",$J36<=0,$J$53=\"No\"),\"\",Y36*Z36)","v":""},null,{"$f":"IF(OR($E36=\"-\",$G36=\"-\",$J36<=0,$J$53=\"No\"),\"\",VLOOKUP($E36,'Data source'!$B$15:$I$99,4,FALSE))","v":""},{"$f":"IF(OR($E36=\"-\",$G36=\"-\",$J36<=0,$J$53=\"No\"),\"\",(($Y36/$Y$49)*AD36))","v":""},null,{"$f":"IF(OR($E36=\"-\",$G36=\"-\",$J36<=0,$J$53=\"No\"),\"\",VLOOKUP($E36,'Data source'!$B$15:$I$99,5,FALSE))","v":""},{"$f":"IF(OR($E36=\"-\",$G36=\"-\",$J36<=0,$J$53=\"No\"),\"\",(($Y36/$Y$49)*AG36))","v":""},null,{"$f":"IF(OR($E36=\"-\",$G36=\"-\",$J36<=0,$J$53=\"No\"),\"\",VLOOKUP($E36,'Data source'!$B$15:$I$99,6,FALSE))","v":""},{"$f":"IF(OR($E36=\"-\",$G36=\"-\",$J36<=0,$J$53=\"No\"),\"\",(($Y36/$Y$49)*AJ36))","v":""},null,{"$f":"IF(OR($E36=\"-\",$G36=\"-\",$J36<=0,$J$53=\"No\"),\"\",VLOOKUP($E36,'Data source'!$B$15:$I$99,7,FALSE))","v":""},{"$f":"IF(OR($E36=\"-\",$G36=\"-\",$J36<=0,$J$53=\"No\"),\"\",(($Y36/$Y$49)*AM36))","v":""},null,{"$f":"IF(OR($E36=\"-\",$G36=\"-\",$J36<=0,$J$53=\"No\"),\"\",VLOOKUP($E36,'Data source'!$B$15:$I$99,8,FALSE))","v":""},{"$f":"IF(OR($E36=\"-\",$G36=\"-\",$J36=\"\",$J$53=\"No\"),\"\",(AP36/100*AN36)*($Y36/$Y$49))","v":""},null,{"$f":"IF(OR($E36=\"-\",$G36=\"-\",$J36<=0,$J$53=\"No\"),\"\",VLOOKUP($E36,'Data source'!$B$15:$M$99,12,FALSE))","v":""},{"$f":"IF(OR($E36=\"-\",$G36=\"-\",$J36<=0,$J$53=\"No\"),\"\",IF($AS36=\"Dry\",$O36/$X36/10,IF($AS36=\"Wet\",$O36/($AA36/100)*$X36/10,0)))","v":""},{"$f":"IF(OR($E36=\"-\",$G36=\"-\",$J36<=0,$J$53=\"No\"),\"\",AT36/Z36)","v":""},{"$f":"IF(OR($E36=\"-\",$G36=\"-\",$J36<=0,$J$53=\"No\"),\"\",($AT36*$J36)/100)","v":""},null,null,null,{"$f":"IF(OR($E36=\"-\",$G36=\"-\",$J36<=0,$J$53=\"No\"),\"\",VLOOKUP($E36,'Data source'!$B$12:$M$99,9,FALSE))","v":""},null,{"$f":"IF(OR($E36=\"-\",$G36=\"-\",$J36<=0,$J$53=\"No\"),\"\",VLOOKUP($E36,'Data source'!$B$12:$M$99,10,FALSE))","v":""},null,{"$f":"IF(OR($E36=\"-\",$G36=\"-\",$J36<=0,$J$53=\"No\"),\"\",VLOOKUP($E36,'Data source'!$B$12:$M$99,11,FALSE))","v":""},null,null,null,{"$f":"IF(OR($E36=\"-\",$G36=\"-\",$J36<=0,$J$53=\"No\"),0,VLOOKUP($E36,'Data source'!$B$15:$T$99,13,FALSE))","v":0},{"$f":"IF(OR($E36=\"-\",$G36=\"-\",$J36<=0,$J$53=\"No\"),0,VLOOKUP($E36,'Data source'!$B$15:$T$99,14,FALSE))","v":0},{"$f":"IF(OR($E36=\"-\",$G36=\"-\",$J36<=0,$J$53=\"No\"),0,VLOOKUP($E36,'Data source'!$B$15:$T$99,15,FALSE))","v":0},{"$f":"IF(OR($E36=\"-\",$G36=\"-\",$J36<=0,$J$53=\"No\"),0,VLOOKUP($E36,'Data source'!$B$15:$T$99,16,FALSE))","v":0},{"$f":"IF(OR($E36=\"-\",$G36=\"-\",$J36<=0,$J$53=\"No\"),0,VLOOKUP($E36,'Data source'!$B$15:$T$99,17,FALSE))","v":0},{"$f":"IF(OR($E36=\"-\",$G36=\"-\",$J36<=0,$J$53=\"No\"),0,VLOOKUP($E36,'Data source'!$B$15:$T$99,18,FALSE))","v":0},{"$f":"IF(OR($E36=\"-\",$G36=\"-\",$J36<=0,$J$53=\"No\"),0,VLOOKUP($E36,'Data source'!$B$15:$T$99,19,FALSE))","v":0},{"$f":"IF(OR($E36=\"-\",$G36=\"-\",$J36<=0,$J$53=\"No\"),0,((43.498*$BH36)+(25.574*$BI36))-((28.206*$BJ36)+(62.375*$BK36)))*$Y36*10/1000","v":0},null,null,null,null,null,null,null,null,null,null,{"$f":"IF($AZ36=\"\",0,$AZ36*$AE36)","v":0},{"$f":"IF($BB36=\"\",0,$BB36*$AE36)","v":0},{"$f":"IF($BD36=\"\",0,$BD36*$AE36)","v":0}]
[null,null,null,null,null,null,null,null,null,null,null,null,null,null,null,null,null,{"$f":"IF(OR($C36=\"-\",$G36=\"-\",$L37<=0,$J$54=\"No\"),\"\",$L37)","v":""},null,null,null,null,"Opt.2",{"$f":"IF(OR($E36=\"-\",$G36=\"-\",$L37<=0,$J$54=\"No\",$AA$6=\"NO\"),\"\",VLOOKUP($G36,'Data source'!$B$128:$C$137,2,FALSE))","v":""},{"$f":"IF(OR($E36=\"-\",$G36=\"-\",$L37<=0,$J$54=\"No\",$AA$6=\"NO\"),0,$L37*$X37)","v":0},{"$f":"IF(OR($E36=\"-\",$G36=\"-\",$L37<=0,$J$54=\"No\",$AA$6=\"NO\"),\"\",$R$21)","v":""},{"$f":"IF(OR($E36=\"-\",$G36=\"-\",$L37<=0,$J$54=\"No\",$AA$6=\"NO\"),\"\",VLOOKUP($E36,'Data source'!$B$12:$I$99,2,FALSE))","v":""},{"$f":"IF(OR($E36=\"-\",$G36=\"-\",$L37<=0,$J$54=\"No\",$AA$6=\"NO\"),\"\",$Y37*$Z37)","v":""},null,{"$f":"IF(OR($E36=\"-\",$G36=\"-\",$L37<=0,$J$54=\"No\",$AA$6=\"NO\"),\"\",VLOOKUP($E36,'Data source'!$B$12:$I$99,4,FALSE))","v":""},{"$f":"IF(OR($E36=\"-\",$G36=\"-\",$L37<=0,$J$54=\"No\",$AA$6=\"NO\"),\"\",(($Y37/$Y$50)*$AD37))","v":""},null,{"$f":"IF(OR($E36=\"-\",$G36=\"-\",$L37<=0,$J$54=\"No\",$AA$6=\"NO\"),\"\",VLOOKUP($E36,'Data source'!$B$12:$I$99,5,FALSE))","v":""},{"$f":"IF(OR($E36=\"-\",$G36=\"-\",$L37<=0,$J$54=\"No\",$AA$6=\"NO\"),\"\",(($Y37/$Y$50)*AG37))","v":""},null,{"$f":"IF(OR($E36=\"-\",$G36=\"-\",$L37<=0,$J$54=\"No\",$AA$6=\"NO\"),\"\",VLOOKUP($E36,'Data source'!$B$12:$I$99,6,FALSE))","v":""},{"$f":"IF(OR($E36=\"-\",$G36=\"-\",$L37<=0,$J$54=\"No\",$AA$6=\"NO\"),\"\",(($Y37/$Y$50)*AJ37))","v":""},null,{"$f":"IF(OR($E36=\"-\",$G36=\"-\",$L37<=0,$J$54=\"No\",$AA$6=\"NO\"),\"\",VLOOKUP($E36,'Data source'!$B$12:$I$99,7,FALSE))","v":""},{"$f":"IF(OR($E36=\"-\",$G36=\"-\",$L37<=0,$J$54=\"No\",$AA$6=\"NO\"),\"\",(($Y37/$Y$50)*AM37))","v":""},null,{"$f":"IF(OR($E36=\"-\",$G36=\"-\",$L37<=0,$J$54=\"No\",$AA$6=\"NO\"),\"\",VLOOKUP($E36,'Data source'!$B$12:$I$99,8,FALSE))","v":""},{"$f":"IF(OR($E36=\"-\",$G36=\"-\",$L37<=0,$J$54=\"No\",$AA$6=\"NO\"),\"\",(AP37/100*AN37)*($Y37/$Y$50))","v":""},null,{"$f":"IF(OR($E36=\"-\",$G36=\"-\",$L37<=0,$J$54=\"No\",$AA$6=\"NO\"),\"\",VLOOKUP($E36,'Data source'!$B$15:$M$99,12,FALSE))","v":""},{"$f":"IF(OR($E36=\"-\",$G36=\"-\",$L37<=0,$J$54=\"No\",$AA$6=\"NO\"),\"\",IF($AS37=\"Dry\",$O36/$X37/10,IF($AS37=\"Wet\",$O36/($AA37/100)*$X37/10,0)))","v":""},{"$f":"IF(OR($E36=\"-\",$G36=\"-\",$L37<=0,$J$54=\"No\",$AA$6=\"NO\"),\"\",IF(OR($H23=\"-\",$Q37=\"-\",$L37=0),\"\",AT37/Z37))","v":""},{"$f":"IF(OR($E36=\"-\",$G36=\"-\",$L37<=0,$J$54=\"No\",$AA$6=\"NO\"),\"\",IF(OR($H23=\"-\",$Q37=\"-\",$L37=0),\"\",($AT37*$L37)/100))","v":""},null,null,null,{"$f":"IF(OR($E36=\"-\",$G36=\"-\",$L37<=0,$J$54=\"No\",$AA$6=\"NO\"),\"\",VLOOKUP($E36,'Data source'!$B$15:$M$99,9,FALSE))","v":""},null,{"$f":"IF(OR($E36=\"-\",$G36=\"-\",$L37<=0,$J$54=\"No\",$AA$6=\"NO\"),\"\",VLOOKUP($E36,'Data source'!$B$15:$M$99,10,FALSE))","v":""},null,{"$f":"IF(OR($E36=\"-\",$G36=\"-\",$L37<=0,$J$54=\"No\",$AA$6=\"NO\"),\"\",VLOOKUP($E36,'Data source'!$B$15:$M$99,11,FALSE))","v":""},null,null,null,{"$f":"IF(OR($E36=\"-\",$G36=\"-\",$L37<=0,$J$54=\"No\",$AA$6=\"NO\"),0,VLOOKUP($E36,'Data source'!$B$15:$T$99,13,FALSE))","v":0},{"$f":"IF(OR($E36=\"-\",$G36=\"-\",$L37<=0,$J$54=\"No\",$AA$6=\"NO\"),0,VLOOKUP($E36,'Data source'!$B$15:$T$99,14,FALSE))","v":0},{"$f":"IF(OR($E36=\"-\",$G36=\"-\",$L37<=0,$J$54=\"No\",$AA$6=\"NO\"),0,VLOOKUP($E36,'Data source'!$B$15:$T$99,15,FALSE))","v":0},{"$f":"IF(OR($E36=\"-\",$G36=\"-\",$L37<=0,$J$54=\"No\",$AA$6=\"NO\"),0,VLOOKUP($E36,'Data source'!$B$15:$T$99,16,FALSE))","v":0},{"$f":"IF(OR($E36=\"-\",$G36=\"-\",$L37<=0,$J$54=\"No\",$AA$6=\"NO\"),0,VLOOKUP($E36,'Data source'!$B$15:$T$99,17,FALSE))","v":0},{"$f":"IF(OR($E36=\"-\",$G36=\"-\",$L37<=0,$J$54=\"No\",$AA$6=\"NO\"),0,VLOOKUP($E36,'Data source'!$B$15:$T$99,18,FALSE))","v":0},{"$f":"IF(OR($E36=\"-\",$G36=\"-\",$L37<=0,$J$54=\"No\",$AA$6=\"NO\"),0,VLOOKUP($E36,'Data source'!$B$15:$T$99,19,FALSE))","v":0},{"$f":"IF(OR($E36=\"-\",$G36=\"-\",$L37<=0,$J$54=\"No\",$AA$6=\"NO\"),0,((43.498*$BH37)+(25.574*$BI37))-((28.206*$BJ37)+(62.375*$BK37)))*$Y37*10/1000","v":0},null,null,null,null,null,null,null,null,null,null,{"$f":"IF($AZ37=\"\",0,$AZ37*$AE37)","v":0},{"$f":"IF($BB37=\"\",0,$BB37*$AE37)","v":0},{"$f":"IF($BD37=\"\",0,$BD37*$AE37)","v":0}]
[]
[null,null,{"$f":"IF('   ASK    '!W17=\"\",\"\",'   ASK    '!W17)","v":"By_products"},null,{"$f":"IF('   ASK    '!Y17=\"\",\"\",'   ASK    '!Y17)","v":"PKE"},null,"-",null,null,null,null,null,null,null,null,null,null,{"$f":"IF(OR($C39=\"-\",$G39=\"-\",$J39<=0,$J$53=\"No\"),\"\",$J39)","v":""},{"$f":"IF(OR($C39=\"-\",$G39=\"-\",$J$53=\"No\"),0,1)","v":0},null,null,{"$f":"C39","v":"By_products"},"Opt.1",{"$f":"IF(OR($E39=\"-\",$G39=\"-\",$J39<=0,$J$53=\"No\"),\"\",VLOOKUP($G39,'Data source'!$B$128:$C$137,2,FALSE))","v":""},{"$f":"IF(OR($E39=\"-\",$G39=\"-\",$J39<=0,$J$53=\"No\"),0,J39*X39)","v":0},{"$f":"IF(OR($E39=\"-\",$G39=\"-\",$J39<=0,$J$53=\"No\"),\"\",$R$21)","v":""},{"$f":"IF(OR($E39=\"-\",$G39=\"-\",$J39<=0,$J$53=\"No\"),\"\",VLOOKUP($E39,'Data source'!$B$15:$I$99,2,FALSE))","v":""},{"$f":"IF(OR($E39=\"-\",$G39=\"-\",$J39<=0,$J$53=\"No\"),\"\",Y39*Z39)","v":""},null,{"$f":"IF(OR($E39=\"-\",$G39=\"-\",$J39<=0,$J$53=\"No\"),\"\",VLOOKUP($E39,'Data source'!$B$15:$I$99,4,FALSE))","v":""},{"$f":"IF(OR($E39=\"-\",$G39=\"-\",$J39<=0,$J$53=\"No\"),\"\",(($Y39/$Y$49)*AD39))","v":""},null,{"$f":"IF(OR($E39=\"-\",$G39=\"-\",$J39<=0,$J$53=\"No\"),\"\",VLOOKUP($E39,'Data source'!$B$15:$I$99,5,FALSE))","v":""},{"$f":"IF(OR($E39=\"-\",$G39=\"-\",$J39<=0,$J$53=\"No\"),\"\",(($Y39/$Y$49)*AG39))","v":""},null,{"$f":"IF(OR($E39=\"-\",$G39=\"-\",$J39<=0,$J$53=\"No\"),\"\",VLOOKUP($E39,'Data source'!$B$15:$I$99,6,FALSE))","v":""},{"$f":"IF(OR($E39=\"-\",$G39=\"-\",$J39<=0,$J$53=\"No\"),\"\",(($Y39/$Y$49)*AJ39))","v":""},null,{"$f":"IF(OR($E39=\"-\",$G39=\"-\",$J39<=0,$J$53=\"No\"),\"\",VLOOKUP($E39,'Data source'!$B$15:$I$99,7,FALSE))","v":""},{"$f":"IF(OR($E39=\"-\",$G39=\"-\",$J39<=0,$J$53=\"No\"),\"\",(($Y39/$Y$49)*AM39))","v":""},null,{"$f":"IF(OR($E39=\"-\",$G39=\"-\",$J39<=0,$J$53=\"No\"),\"\",VLOOKUP($E39,'Data source'!$B$15:$I$99,8,FALSE))","v":""},{"$f":"IF(OR($E39=\"-\",$G39=\"-\",$J39=\"\",$J$53=\"No\"),\"\",(AP39/100*AN39)*($Y39/$Y$49))","v":""},null,{"$f":"IF(OR($E39=\"-\",$G39=\"-\",$J39<=0,$J$53=\"No\"),\"\",VLOOKUP($E39,'Data source'!$B$15:$M$99,12,FALSE))","v":""},{"$f":"IF(OR($E39=\"-\",$G39=\"-\",$J39<=0,$J$53=\"No\"),\"\",IF($AS39=\"Dry\",$O39/$X39/10,IF($AS39=\"Wet\",$O39/($AA39/100)*$X39/10,0)))","v":""},{"$f":"IF(OR($E39=\"-\",$G39=\"-\",$J39<=0,$J$53=\"No\"),\"\",AT39/Z39)","v":""},{"$f":"IF(OR($E39=\"-\",$G39=\"-\",$J39<=0,$J$53=\"No\"),\"\",($AT39*$J39)/100)","v":""},null,null,null,{"$f":"IF(OR($E39=\"-\",$G39=\"-\",$J39<=0,$J$53=\"No\"),\"\",VLOOKUP($E39,'Data source'!$B$12:$M$99,9,FALSE))","v":""},null,{"$f":"IF(OR($E39=\"-\",$G39=\"-\",$J39<=0,$J$53=\"No\"),\"\",VLOOKUP($E39,'Data source'!$B$12:$M$99,10,FALSE))","v":""},null,{"$f":"IF(OR($E39=\"-\",$G39=\"-\",$J39<=0,$J$53=\"No\"),\"\",VLOOKUP($E39,'Data source'!$B$12:$M$99,11,FALSE))","v":""},null,null,null,{"$f":"IF(OR($E39=\"-\",$G39=\"-\",$J39<=0,$J$53=\"No\"),0,VLOOKUP($E39,'Data source'!$B$15:$T$99,13,FALSE))","v":0},{"$f":"IF(OR($E39=\"-\",$G39=\"-\",$J39<=0,$J$53=\"No\"),0,VLOOKUP($E39,'Data source'!$B$15:$T$99,14,FALSE))","v":0},{"$f":"IF(OR($E39=\"-\",$G39=\"-\",$J39<=0,$J$53=\"No\"),0,VLOOKUP($E39,'Data source'!$B$15:$T$99,15,FALSE))","v":0},{"$f":"IF(OR($E39=\"-\",$G39=\"-\",$J39<=0,$J$53=\"No\"),0,VLOOKUP($E39,'Data source'!$B$15:$T$99,16,FALSE))","v":0},{"$f":"IF(OR($E39=\"-\",$G39=\"-\",$J39<=0,$J$53=\"No\"),0,VLOOKUP($E39,'Data source'!$B$15:$T$99,17,FALSE))","v":0},{"$f":"IF(OR($E39=\"-\",$G39=\"-\",$J39<=0,$J$53=\"No\"),0,VLOOKUP($E39,'Data source'!$B$15:$T$99,18,FALSE))","v":0},{"$f":"IF(OR($E39=\"-\",$G39=\"-\",$J39<=0,$J$53=\"No\"),0,VLOOKUP($E39,'Data source'!$B$15:$T$99,19,FALSE))","v":0},{"$f":"IF(OR($E39=\"-\",$G39=\"-\",$J39<=0,$J$53=\"No\"),0,((43.498*$BH39)+(25.574*$BI39))-((28.206*$BJ39)+(62.375*$BK39)))*$Y39*10/1000","v":0},null,null,null,null,null,null,null,null,null,null,{"$f":"IF($AZ39=\"\",0,$AZ39*$AE39)","v":0},{"$f":"IF($BB39=\"\",0,$BB39*$AE39)","v":0},{"$f":"IF($BD39=\"\",0,$BD39*$AE39)","v":0}]
[null,null,null,null,null,null,null,null,null,null,null,null,null,null,null,null,null,{"$f":"IF(OR($C39=\"-\",$G39=\"-\",$L40<=0,$J$54=\"No\"),\"\",$L40)","v":""},null,null,null,null,"Opt.2",{"$f":"IF(OR($E39=\"-\",$G39=\"-\",$L40<=0,$J$54=\"No\",$AA$6=\"NO\"),\"\",VLOOKUP($G39,'Data source'!$B$128:$C$137,2,FALSE))","v":""},{"$f":"IF(OR($E39=\"-\",$G39=\"-\",$L40<=0,$J$54=\"No\",$AA$6=\"NO\"),0,$L40*$X40)","v":0},{"$f":"IF(OR($E39=\"-\",$G39=\"-\",$L40<=0,$J$54=\"No\",$AA$6=\"NO\"),\"\",$R$21)","v":""},{"$f":"IF(OR($E39=\"-\",$G39=\"-\",$L40<=0,$J$54=\"No\",$AA$6=\"NO\"),\"\",VLOOKUP($E39,'Data source'!$B$12:$I$99,2,FALSE))","v":""},{"$f":"IF(OR($E39=\"-\",$G39=\"-\",$L40<=0,$J$54=\"No\",$AA$6=\"NO\"),\"\",$Y40*$Z40)","v":""},null,{"$f":"IF(OR($E39=\"-\",$G39=\"-\",$L40<=0,$J$54=\"No\",$AA$6=\"NO\"),\"\",VLOOKUP($E39,'Data source'!$B$12:$I$99,4,FALSE))","v":""},{"$f":"IF(OR($E39=\"-\",$G39=\"-\",$L40<=0,$J$54=\"No\",$AA$6=\"NO\"),\"\",(($Y40/$Y$50)*$AD40))","v":""},null,{"$f":"IF(OR($E39=\"-\",$G39=\"-\",$L40<=0,$J$54=\"No\",$AA$6=\"NO\"),\"\",VLOOKUP($E39,'Data source'!$B$12:$I$99,5,FALSE))","v":""},{"$f":"IF(OR($E39=\"-\",$G39=\"-\",$L40<=0,$J$54=\"No\",$AA$6=\"NO\"),\"\",(($Y40/$Y$50)*AG40))","v":""},null,{"$f":"IF(OR($E39=\"-\",$G39=\"-\",$L40<=0,$J$54=\"No\",$AA$6=\"NO\"),\"\",VLOOKUP($E39,'Data source'!$B$12:$I$99,6,FALSE))","v":""},{"$f":"IF(OR($E39=\"-\",$G39=\"-\",$L40<=0,$J$54=\"No\",$AA$6=\"NO\"),\"\",(($Y40/$Y$50)*AJ40))","v":""},null,{"$f":"IF(OR($E39=\"-\",$G39=\"-\",$L40<=0,$J$54=\"No\",$AA$6=\"NO\"),\"\",VLOOKUP($E39,'Data source'!$B$12:$I$99,7,FALSE))","v":""},{"$f":"IF(OR($E39=\"-\",$G39=\"-\",$L40<=0,$J$54=\"No\",$AA$6=\"NO\"),\"\",(($Y40/$Y$50)*AM40))","v":""},null,{"$f":"IF(OR($E39=\"-\",$G39=\"-\",$L40<=0,$J$54=\"No\",$AA$6=\"NO\"),\"\",VLOOKUP($E39,'Data source'!$B$12:$I$99,8,FALSE))","v":""},{"$f":"IF(OR($E39=\"-\",$G39=\"-\",$L40<=0,$J$54=\"No\",$AA$6=\"NO\"),\"\",(AP40/100*AN40)*($Y40/$Y$50))","v":""},null,{"$f":"IF(OR($E39=\"-\",$G39=\"-\",$L40<=0,$J$54=\"No\",$AA$6=\"NO\"),\"\",VLOOKUP($E39,'Data source'!$B$15:$M$99,12,FALSE))","v":""},{"$f":"IF(OR($E39=\"-\",$G39=\"-\",$L40<=0,$J$54=\"No\",$AA$6=\"NO\"),\"\",IF($AS40=\"Dry\",$O39/$X40/10,IF($AS40=\"Wet\",$O39/($AA40/100)*$X40/10,0)))","v":""},{"$f":"IF(OR($E39=\"-\",$G39=\"-\",$L40<=0,$J$54=\"No\",$AA$6=\"NO\"),\"\",IF(OR($H26=\"-\",$Q40=\"-\",$L40=0),\"\",AT40/Z40))","v":""},{"$f":"IF(OR($E39=\"-\",$G39=\"-\",$L40<=0,$J$54=\"No\",$AA$6=\"NO\"),\"\",IF(OR($H26=\"-\",$Q40=\"-\",$L40=0),\"\",($AT40*$L40)/100))","v":""},null,null,null,{"$f":"IF(OR($E39=\"-\",$G39=\"-\",$L40<=0,$J$54=\"No\",$AA$6=\"NO\"),\"\",VLOOKUP($E39,'Data source'!$B$15:$M$99,9,FALSE))","v":""},null,{"$f":"IF(OR($E39=\"-\",$G39=\"-\",$L40<=0,$J$54=\"No\",$AA$6=\"NO\"),\"\",VLOOKUP($E39,'Data source'!$B$15:$M$99,10,FALSE))","v":""},null,{"$f":"IF(OR($E39=\"-\",$G39=\"-\",$L40<=0,$J$54=\"No\",$AA$6=\"NO\"),\"\",VLOOKUP($E39,'Data source'!$B$15:$M$99,11,FALSE))","v":""},null,null,null,{"$f":"IF(OR($E39=\"-\",$G39=\"-\",$L40<=0,$J$54=\"No\",$AA$6=\"NO\"),0,VLOOKUP($E39,'Data source'!$B$15:$T$99,13,FALSE))","v":0},{"$f":"IF(OR($E39=\"-\",$G39=\"-\",$L40<=0,$J$54=\"No\",$AA$6=\"NO\"),0,VLOOKUP($E39,'Data source'!$B$15:$T$99,14,FALSE))","v":0},{"$f":"IF(OR($E39=\"-\",$G39=\"-\",$L40<=0,$J$54=\"No\",$AA$6=\"NO\"),0,VLOOKUP($E39,'Data source'!$B$15:$T$99,15,FALSE))","v":0},{"$f":"IF(OR($E39=\"-\",$G39=\"-\",$L40<=0,$J$54=\"No\",$AA$6=\"NO\"),0,VLOOKUP($E39,'Data source'!$B$15:$T$99,16,FALSE))","v":0},{"$f":"IF(OR($E39=\"-\",$G39=\"-\",$L40<=0,$J$54=\"No\",$AA$6=\"NO\"),0,VLOOKUP($E39,'Data source'!$B$15:$T$99,17,FALSE))","v":0},{"$f":"IF(OR($E39=\"-\",$G39=\"-\",$L40<=0,$J$54=\"No\",$AA$6=\"NO\"),0,VLOOKUP($E39,'Data source'!$B$15:$T$99,18,FALSE))","v":0},{"$f":"IF(OR($E39=\"-\",$G39=\"-\",$L40<=0,$J$54=\"No\",$AA$6=\"NO\"),0,VLOOKUP($E39,'Data source'!$B$15:$T$99,19,FALSE))","v":0},{"$f":"IF(OR($E39=\"-\",$G39=\"-\",$L40<=0,$J$54=\"No\",$AA$6=\"NO\"),0,((43.498*$BH40)+(25.574*$BI40))-((28.206*$BJ40)+(62.375*$BK40)))*$Y40*10/1000","v":0},null,null,null,null,null,null,null,null,null,null,{"$f":"IF($AZ40=\"\",0,$AZ40*$AE40)","v":0},{"$f":"IF($BB40=\"\",0,$BB40*$AE40)","v":0},{"$f":"IF($BD40=\"\",0,$BD40*$AE40)","v":0}]
[]
[null,null,{"$f":"IF('   ASK    '!W20=\"\",\"\",'   ASK    '!W20)","v":"Minerals"},null,{"$f":"IF('   ASK    '!Y20=\"\",\"\",'   ASK    '!Y20)","v":"CaCO3, %DM"},null,"-",null,null,null,null,null,null,null,null,null,null,{"$f":"IF(OR($C42=\"-\",$G42=\"-\",$J42<=0,$J$53=\"No\"),\"\",$J42)","v":""},{"$f":"IF(OR($C42=\"-\",$G42=\"-\",$J$53=\"No\"),0,1)","v":0},null,null,{"$f":"C42","v":"Minerals"},"Opt.1",{"$f":"IF(OR($E42=\"-\",$G42=\"-\",$J42<=0,$J$53=\"No\"),\"\",VLOOKUP($G42,'Data source'!$B$128:$C$137,2,FALSE))","v":""},{"$f":"IF(OR($E42=\"-\",$G42=\"-\",$J42<=0,$J$53=\"No\"),0,J42*X42)","v":0},{"$f":"IF(OR($E42=\"-\",$G42=\"-\",$J42<=0,$J$53=\"No\"),\"\",$R$21)","v":""},{"$f":"IF(OR($E42=\"-\",$G42=\"-\",$J42<=0,$J$53=\"No\"),\"\",VLOOKUP($E42,'Data source'!$B$15:$I$99,2,FALSE))","v":""},{"$f":"IF(OR($E42=\"-\",$G42=\"-\",$J42<=0,$J$53=\"No\"),\"\",Y42*Z42)","v":""},null,{"$f":"IF(OR($E42=\"-\",$G42=\"-\",$J42<=0,$J$53=\"No\"),\"\",VLOOKUP($E42,'Data source'!$B$15:$I$99,4,FALSE))","v":""},{"$f":"IF(OR($E42=\"-\",$G42=\"-\",$J42<=0,$J$53=\"No\"),\"\",(($Y42/$Y$49)*AD42))","v":""},null,{"$f":"IF(OR($E42=\"-\",$G42=\"-\",$J42<=0,$J$53=\"No\"),\"\",VLOOKUP($E42,'Data source'!$B$15:$I$99,5,FALSE))","v":""},{"$f":"IF(OR($E42=\"-\",$G42=\"-\",$J42<=0,$J$53=\"No\"),\"\",(($Y42/$Y$49)*AG42))","v":""},null,{"$f":"IF(OR($E42=\"-\",$G42=\"-\",$J42<=0,$J$53=\"No\"),\"\",VLOOKUP($E42,'Data source'!$B$15:$I$99,6,FALSE))","v":""},{"$f":"IF(OR($E42=\"-\",$G42=\"-\",$J42<=0,$J$53=\"No\"),\"\",(($Y42/$Y$49)*AJ42))","v":""},null,{"$f":"IF(OR($E42=\"-\",$G42=\"-\",$J42<=0,$J$53=\"No\"),\"\",VLOOKUP($E42,'Data source'!$B$15:$I$99,7,FALSE))","v":""},{"$f":"IF(OR($E42=\"-\",$G42=\"-\",$J42<=0,$J$53=\"No\"),\"\",(($Y42/$Y$49)*AM42))","v":""},null,{"$f":"IF(OR($E42=\"-\",$G42=\"-\",$J42<=0,$J$53=\"No\"),\"\",VLOOKUP($E42,'Data source'!$B$15:$I$99,8,FALSE))","v":""},{"$f":"IF(OR($E42=\"-\",$G42=\"-\",$J42=\"\",$J$53=\"No\"),\"\",(AP42/100*AN42)*($Y42/$Y$49))","v":""},null,{"$f":"IF(OR($E42=\"-\",$G42=\"-\",$J42<=0,$J$53=\"No\"),\"\",VLOOKUP($E42,'Data source'!$B$15:$M$99,12,FALSE))","v":""},{"$f":"IF(OR($E42=\"-\",$G42=\"-\",$J42<=0,$J$53=\"No\"),\"\",IF($AS42=\"Dry\",$O42/$X42/10,IF($AS42=\"Wet\",$O42/($AA42/100)*$X42/10,0)))","v":""},{"$f":"IF(OR($E42=\"-\",$G42=\"-\",$J42<=0,$J$53=\"No\"),\"\",AT42/Z42)","v":""},{"$f":"IF(OR($E42=\"-\",$G42=\"-\",$J42<=0,$J$53=\"No\"),\"\",($AT42*$J42)/100)","v":""},null,null,null,{"$f":"IF(OR($E42=\"-\",$G42=\"-\",$J42<=0,$J$53=\"No\"),\"\",VLOOKUP($E42,'Data source'!$B$12:$M$99,9,FALSE))","v":""},null,{"$f":"IF(OR($E42=\"-\",$G42=\"-\",$J42<=0,$J$53=\"No\"),\"\",VLOOKUP($E42,'Data source'!$B$12:$M$99,10,FALSE))","v":""},null,{"$f":"IF(OR($E42=\"-\",$G42=\"-\",$J42<=0,$J$53=\"No\"),\"\",VLOOKUP($E42,'Data source'!$B$12:$M$99,11,FALSE))","v":""},null,null,null,{"$f":"IF(OR($E42=\"-\",$G42=\"-\",$J42<=0,$J$53=\"No\"),0,VLOOKUP($E42,'Data source'!$B$15:$T$99,13,FALSE))","v":0},{"$f":"IF(OR($E42=\"-\",$G42=\"-\",$J42<=0,$J$53=\"No\"),0,VLOOKUP($E42,'Data source'!$B$15:$T$99,14,FALSE))","v":0},{"$f":"IF(OR($E42=\"-\",$G42=\"-\",$J42<=0,$J$53=\"No\"),0,VLOOKUP($E42,'Data source'!$B$15:$T$99,15,FALSE))","v":0},{"$f":"IF(OR($E42=\"-\",$G42=\"-\",$J42<=0,$J$53=\"No\"),0,VLOOKUP($E42,'Data source'!$B$15:$T$99,16,FALSE))","v":0},{"$f":"IF(OR($E42=\"-\",$G42=\"-\",$J42<=0,$J$53=\"No\"),0,VLOOKUP($E42,'Data source'!$B$15:$T$99,17,FALSE))","v":0},{"$f":"IF(OR($E42=\"-\",$G42=\"-\",$J42<=0,$J$53=\"No\"),0,VLOOKUP($E42,'Data source'!$B$15:$T$99,18,FALSE))","v":0},{"$f":"IF(OR($E42=\"-\",$G42=\"-\",$J42<=0,$J$53=\"No\"),0,VLOOKUP($E42,'Data source'!$B$15:$T$99,19,FALSE))","v":0},{"$f":"IF(OR($E42=\"-\",$G42=\"-\",$J42<=0,$J$53=\"No\"),0,((43.498*$BH42)+(25.574*$BI42))-((28.206*$BJ42)+(62.375*$BK42)))*$Y42*10/1000","v":0},null,null,null,null,null,null,null,null,null,null,{"$f":"IF($AZ42=\"\",0,$AZ42*$AE42)","v":0},{"$f":"IF($BB42=\"\",0,$BB42*$AE42)","v":0},{"$f":"IF($BD42=\"\",0,$BD42*$AE42)","v":0}]
[null,null,null,null,null,null,null,null,null,null,null,null,null,null,null,null,null,{"$f":"IF(OR($C42=\"-\",$G42=\"-\",$L43<=0,$J$54=\"No\"),\"\",$L43)","v":""},null,null,null,null,"Opt.2",{"$f":"IF(OR($E42=\"-\",$G42=\"-\",$L43<=0,$J$54=\"No\",$AA$6=\"NO\"),\"\",VLOOKUP($G42,'Data source'!$B$128:$C$137,2,FALSE))","v":""},{"$f":"IF(OR($E42=\"-\",$G42=\"-\",$L43<=0,$J$54=\"No\",$AA$6=\"NO\"),0,$L43*$X43)","v":0},{"$f":"IF(OR($E42=\"-\",$G42=\"-\",$L43<=0,$J$54=\"No\",$AA$6=\"NO\"),\"\",$R$21)","v":""},{"$f":"IF(OR($E42=\"-\",$G42=\"-\",$L43<=0,$J$54=\"No\",$AA$6=\"NO\"),\"\",VLOOKUP($E42,'Data source'!$B$12:$I$99,2,FALSE))","v":""},{"$f":"IF(OR($E42=\"-\",$G42=\"-\",$L43<=0,$J$54=\"No\",$AA$6=\"NO\"),\"\",$Y43*$Z43)","v":""},null,{"$f":"IF(OR($E42=\"-\",$G42=\"-\",$L43<=0,$J$54=\"No\",$AA$6=\"NO\"),\"\",VLOOKUP($E42,'Data source'!$B$12:$I$99,4,FALSE))","v":""},{"$f":"IF(OR($E42=\"-\",$G42=\"-\",$L43<=0,$J$54=\"No\",$AA$6=\"NO\"),\"\",(($Y43/$Y$50)*$AD43))","v":""},null,{"$f":"IF(OR($E42=\"-\",$G42=\"-\",$L43<=0,$J$54=\"No\",$AA$6=\"NO\"),\"\",VLOOKUP($E42,'Data source'!$B$12:$I$99,5,FALSE))","v":""},{"$f":"IF(OR($E42=\"-\",$G42=\"-\",$L43<=0,$J$54=\"No\",$AA$6=\"NO\"),\"\",(($Y43/$Y$50)*AG43))","v":""},null,{"$f":"IF(OR($E42=\"-\",$G42=\"-\",$L43<=0,$J$54=\"No\",$AA$6=\"NO\"),\"\",VLOOKUP($E42,'Data source'!$B$12:$I$99,6,FALSE))","v":""},{"$f":"IF(OR($E42=\"-\",$G42=\"-\",$L43<=0,$J$54=\"No\",$AA$6=\"NO\"),\"\",(($Y43/$Y$50)*AJ43))","v":""},null,{"$f":"IF(OR($E42=\"-\",$G42=\"-\",$L43<=0,$J$54=\"No\",$AA$6=\"NO\"),\"\",VLOOKUP($E42,'Data source'!$B$12:$I$99,7,FALSE))","v":""},{"$f":"IF(OR($E42=\"-\",$G42=\"-\",$L43<=0,$J$54=\"No\",$AA$6=\"NO\"),\"\",(($Y43/$Y$50)*AM43))","v":""},null,{"$f":"IF(OR($E42=\"-\",$G42=\"-\",$L43<=0,$J$54=\"No\",$AA$6=\"NO\"),\"\",VLOOKUP($E42,'Data source'!$B$12:$I$99,8,FALSE))","v":""},{"$f":"IF(OR($E42=\"-\",$G42=\"-\",$L43<=0,$J$54=\"No\",$AA$6=\"NO\"),\"\",(AP43/100*AN43)*($Y43/$Y$50))","v":""},null,{"$f":"IF(OR($E42=\"-\",$G42=\"-\",$L43<=0,$J$54=\"No\",$AA$6=\"NO\"),\"\",VLOOKUP($E42,'Data source'!$B$15:$M$99,12,FALSE))","v":""},{"$f":"IF(OR($E42=\"-\",$G42=\"-\",$L43<=0,$J$54=\"No\",$AA$6=\"NO\"),\"\",IF($AS43=\"Dry\",$O42/$X43/10,IF($AS43=\"Wet\",$O42/($AA43/100)*$X43/10,0)))","v":""},{"$f":"IF(OR($E42=\"-\",$G42=\"-\",$L43<=0,$J$54=\"No\",$AA$6=\"NO\"),\"\",IF(OR($H29=\"-\",$Q43=\"-\",$L43=0),\"\",AT43/Z43))","v":""},{"$f":"IF(OR($E42=\"-\",$G42=\"-\",$L43<=0,$J$54=\"No\",$AA$6=\"NO\"),\"\",IF(OR($H29=\"-\",$Q43=\"-\",$L43=0),\"\",($AT43*$L43)/100))","v":""},null,null,null,{"$f":"IF(OR($E42=\"-\",$G42=\"-\",$L43<=0,$J$54=\"No\",$AA$6=\"NO\"),\"\",VLOOKUP($E42,'Data source'!$B$15:$M$99,9,FALSE))","v":""},null,{"$f":"IF(OR($E42=\"-\",$G42=\"-\",$L43<=0,$J$54=\"No\",$AA$6=\"NO\"),\"\",VLOOKUP($E42,'Data source'!$B$15:$M$99,10,FALSE))","v":""},null,{"$f":"IF(OR($E42=\"-\",$G42=\"-\",$L43<=0,$J$54=\"No\",$AA$6=\"NO\"),\"\",VLOOKUP($E42,'Data source'!$B$15:$M$99,11,FALSE))","v":""},null,null,null,{"$f":"IF(OR($E42=\"-\",$G42=\"-\",$L43<=0,$J$54=\"No\",$AA$6=\"NO\"),0,VLOOKUP($E42,'Data source'!$B$15:$T$99,13,FALSE))","v":0},{"$f":"IF(OR($E42=\"-\",$G42=\"-\",$L43<=0,$J$54=\"No\",$AA$6=\"NO\"),0,VLOOKUP($E42,'Data source'!$B$15:$T$99,14,FALSE))","v":0},{"$f":"IF(OR($E42=\"-\",$G42=\"-\",$L43<=0,$J$54=\"No\",$AA$6=\"NO\"),0,VLOOKUP($E42,'Data source'!$B$15:$T$99,15,FALSE))","v":0},{"$f":"IF(OR($E42=\"-\",$G42=\"-\",$L43<=0,$J$54=\"No\",$AA$6=\"NO\"),0,VLOOKUP($E42,'Data source'!$B$15:$T$99,16,FALSE))","v":0},{"$f":"IF(OR($E42=\"-\",$G42=\"-\",$L43<=0,$J$54=\"No\",$AA$6=\"NO\"),0,VLOOKUP($E42,'Data source'!$B$15:$T$99,17,FALSE))","v":0},{"$f":"IF(OR($E42=\"-\",$G42=\"-\",$L43<=0,$J$54=\"No\",$AA$6=\"NO\"),0,VLOOKUP($E42,'Data source'!$B$15:$T$99,18,FALSE))","v":0},{"$f":"IF(OR($E42=\"-\",$G42=\"-\",$L43<=0,$J$54=\"No\",$AA$6=\"NO\"),0,VLOOKUP($E42,'Data source'!$B$15:$T$99,19,FALSE))","v":0},{"$f":"IF(OR($E42=\"-\",$G42=\"-\",$L43<=0,$J$54=\"No\",$AA$6=\"NO\"),0,((43.498*$BH43)+(25.574*$BI43))-((28.206*$BJ43)+(62.375*$BK43)))*$Y43*10/1000","v":0},null,null,null,null,null,null,null,null,null,null,{"$f":"IF($AZ43=\"\",0,$AZ43*$AE43)","v":0},{"$f":"IF($BB43=\"\",0,$BB43*$AE43)","v":0},{"$f":"IF($BD43=\"\",0,$BD43*$AE43)","v":0}]
[]
[null,null,{"$f":"IF('   ASK    '!W23=\"\",\"\",'   ASK    '!W23)","v":"Concentrates"},null,{"$f":"IF('   ASK    '!Y23=\"\",\"\",'   ASK    '!Y23)","v":"Maize grain"},null,"-",null,null,null,null,null,null,null,null,null,null,{"$f":"IF(OR($C45=\"-\",$G45=\"-\",$J45<=0,$J$53=\"No\"),\"\",$J45)","v":""},{"$f":"IF(OR($C45=\"-\",$G45=\"-\",$J$53=\"No\"),0,1)","v":0},null,null,{"$f":"C45","v":"Concentrates"},"Opt.1",{"$f":"IF(OR($E45=\"-\",$G45=\"-\",$J45<=0,$J$53=\"No\"),\"\",VLOOKUP($G45,'Data source'!$B$128:$C$137,2,FALSE))","v":""},{"$f":"IF(OR($E45=\"-\",$G45=\"-\",$J45<=0,$J$53=\"No\"),0,J45*X45)","v":0},{"$f":"IF(OR($E45=\"-\",$G45=\"-\",$J45<=0,$J$53=\"No\"),\"\",$R$21)","v":""},{"$f":"IF(OR($E45=\"-\",$G45=\"-\",$J45<=0,$J$53=\"No\"),\"\",VLOOKUP($E45,'Data source'!$B$15:$I$99,2,FALSE))","v":""},{"$f":"IF(OR($E45=\"-\",$G45=\"-\",$J45<=0,$J$53=\"No\"),\"\",Y45*Z45)","v":""},null,{"$f":"IF(OR($E45=\"-\",$G45=\"-\",$J45<=0,$J$53=\"No\"),\"\",VLOOKUP($E45,'Data source'!$B$15:$I$99,4,FALSE))","v":""},{"$f":"IF(OR($E45=\"-\",$G45=\"-\",$J45<=0,$J$53=\"No\"),\"\",(($Y45/$Y$49)*AD45))","v":""},null,{"$f":"IF(OR($E45=\"-\",$G45=\"-\",$J45<=0,$J$53=\"No\"),\"\",VLOOKUP($E45,'Data source'!$B$15:$I$99,5,FALSE))","v":""},{"$f":"IF(OR($E45=\"-\",$G45=\"-\",$J45<=0,$J$53=\"No\"),\"\",(($Y45/$Y$49)*AG45))","v":""},null,{"$f":"IF(OR($E45=\"-\",$G45=\"-\",$J45<=0,$J$53=\"No\"),\"\",VLOOKUP($E45,'Data source'!$B$15:$I$99,6,FALSE))","v":""},{"$f":"IF(OR($E45=\"-\",$G45=\"-\",$J45<=0,$J$53=\"No\"),\"\",(($Y45/$Y$49)*AJ45))","v":""},null,{"$f":"IF(OR($E45=\"-\",$G45=\"-\",$J45<=0,$J$53=\"No\"),\"\",VLOOKUP($E45,'Data source'!$B$15:$I$99,7,FALSE))","v":""},{"$f":"IF(OR($E45=\"-\",$G45=\"-\",$J45<=0,$J$53=\"No\"),\"\",(($Y45/$Y$49)*AM45))","v":""},null,{"$f":"IF(OR($E45=\"-\",$G45=\"-\",$J45<=0,$J$53=\"No\"),\"\",VLOOKUP($E45,'Data source'!$B$15:$I$99,8,FALSE))","v":""},{"$f":"IF(OR($E45=\"-\",$G45=\"-\",$J45=\"\",$J$53=\"No\"),\"\",(AP45/100*AN45)*($Y45/$Y$49))","v":""},null,{"$f":"IF(OR($E45=\"-\",$G45=\"-\",$J45<=0,$J$53=\"No\"),\"\",VLOOKUP($E45,'Data source'!$B$15:$M$99,12,FALSE))","v":""},{"$f":"IF(OR($E45=\"-\",$G45=\"-\",$J45<=0,$J$53=\"No\"),\"\",IF($AS45=\"Dry\",$O45/$X45/10,IF($AS45=\"Wet\",$O45/($AA45/100)*$X45/10,0)))","v":""},{"$f":"IF(OR($E45=\"-\",$G45=\"-\",$J45<=0,$J$53=\"No\"),\"\",AT45/Z45)","v":""},{"$f":"IF(OR($E45=\"-\",$G45=\"-\",$J45<=0,$J$53=\"No\"),\"\",($AT45*$J45)/100)","v":""},null,null,null,{"$f":"IF(OR($E45=\"-\",$G45=\"-\",$J45<=0,$J$53=\"No\"),\"\",VLOOKUP($E45,'Data source'!$B$12:$M$99,9,FALSE))","v":""},null,{"$f":"IF(OR($E45=\"-\",$G45=\"-\",$J45<=0,$J$53=\"No\"),\"\",VLOOKUP($E45,'Data source'!$B$12:$M$99,10,FALSE))","v":""},null,{"$f":"IF(OR($E45=\"-\",$G45=\"-\",$J45<=0,$J$53=\"No\"),\"\",VLOOKUP($E45,'Data source'!$B$12:$M$99,11,FALSE))","v":""},null,null,null,{"$f":"IF(OR($E45=\"-\",$G45=\"-\",$J45<=0,$J$53=\"No\"),0,VLOOKUP($E45,'Data source'!$B$15:$T$99,13,FALSE))","v":0},{"$f":"IF(OR($E45=\"-\",$G45=\"-\",$J45<=0,$J$53=\"No\"),0,VLOOKUP($E45,'Data source'!$B$15:$T$99,14,FALSE))","v":0},{"$f":"IF(OR($E45=\"-\",$G45=\"-\",$J45<=0,$J$53=\"No\"),0,VLOOKUP($E45,'Data source'!$B$15:$T$99,15,FALSE))","v":0},{"$f":"IF(OR($E45=\"-\",$G45=\"-\",$J45<=0,$J$53=\"No\"),0,VLOOKUP($E45,'Data source'!$B$15:$T$99,16,FALSE))","v":0},{"$f":"IF(OR($E45=\"-\",$G45=\"-\",$J45<=0,$J$53=\"No\"),0,VLOOKUP($E45,'Data source'!$B$15:$T$99,17,FALSE))","v":0},{"$f":"IF(OR($E45=\"-\",$G45=\"-\",$J45<=0,$J$53=\"No\"),0,VLOOKUP($E45,'Data source'!$B$15:$T$99,18,FALSE))","v":0},{"$f":"IF(OR($E45=\"-\",$G45=\"-\",$J45<=0,$J$53=\"No\"),0,VLOOKUP($E45,'Data source'!$B$15:$T$99,19,FALSE))","v":0},{"$f":"IF(OR($E45=\"-\",$G45=\"-\",$J45<=0,$J$53=\"No\"),0,((43.498*$BH45)+(25.574*$BI45))-((28.206*$BJ45)+(62.375*$BK45)))*$Y45*10/1000","v":0},null,null,null,null,null,null,null,null,null,null,{"$f":"IF($AZ45=\"\",0,$AZ45*$AE45)","v":0},{"$f":"IF($BB45=\"\",0,$BB45*$AE45)","v":0},{"$f":"IF($BD45=\"\",0,$BD45*$AE45)","v":0}]
[null,null,null,null,null,null,null,null,null,null,null,null,null,null,null,null,null,{"$f":"IF(OR($C45=\"-\",$G45=\"-\",$L46<=0,$J$54=\"No\"),\"\",$L46)","v":""},null,null,null,null,"Opt.2",{"$f":"IF(OR($E45=\"-\",$G45=\"-\",$L46<=0,$J$54=\"No\",$AA$6=\"NO\"),\"\",VLOOKUP($G45,'Data source'!$B$128:$C$137,2,FALSE))","v":""},{"$f":"IF(OR($E45=\"-\",$G45=\"-\",$L46<=0,$J$54=\"No\",$AA$6=\"NO\"),0,$L46*$X46)","v":0},{"$f":"IF(OR($E45=\"-\",$G45=\"-\",$L46<=0,$J$54=\"No\",$AA$6=\"NO\"),\"\",$R$21)","v":""},{"$f":"IF(OR($E45=\"-\",$G45=\"-\",$L46<=0,$J$54=\"No\",$AA$6=\"NO\"),\"\",VLOOKUP($E45,'Data source'!$B$12:$I$99,2,FALSE))","v":""},{"$f":"IF(OR($E45=\"-\",$G45=\"-\",$L46<=0,$J$54=\"No\",$AA$6=\"NO\"),\"\",$Y46*$Z46)","v":""},null,{"$f":"IF(OR($E45=\"-\",$G45=\"-\",$L46<=0,$J$54=\"No\",$AA$6=\"NO\"),\"\",VLOOKUP($E45,'Data source'!$B$12:$I$99,4,FALSE))","v":""},{"$f":"IF(OR($E45=\"-\",$G45=\"-\",$L46<=0,$J$54=\"No\",$AA$6=\"NO\"),\"\",(($Y46/$Y$50)*$AD46))","v":""},null,{"$f":"IF(OR($E45=\"-\",$G45=\"-\",$L46<=0,$J$54=\"No\",$AA$6=\"NO\"),\"\",VLOOKUP($E45,'Data source'!$B$12:$I$99,5,FALSE))","v":""},{"$f":"IF(OR($E45=\"-\",$G45=\"-\",$L46<=0,$J$54=\"No\",$AA$6=\"NO\"),\"\",(($Y46/$Y$50)*AG46))","v":""},null,{"$f":"IF(OR($E45=\"-\",$G45=\"-\",$L46<=0,$J$54=\"No\",$AA$6=\"NO\"),\"\",VLOOKUP($E45,'Data source'!$B$12:$I$99,6,FALSE))","v":""},{"$f":"IF(OR($E45=\"-\",$G45=\"-\",$L46<=0,$J$54=\"No\",$AA$6=\"NO\"),\"\",(($Y46/$Y$50)*AJ46))","v":""},null,{"$f":"IF(OR($E45=\"-\",$G45=\"-\",$L46<=0,$J$54=\"No\",$AA$6=\"NO\"),\"\",VLOOKUP($E45,'Data source'!$B$12:$I$99,7,FALSE))","v":""},{"$f":"IF(OR($E45=\"-\",$G45=\"-\",$L46<=0,$J$54=\"No\",$AA$6=\"NO\"),\"\",(($Y46/$Y$50)*AM46))","v":""},null,{"$f":"IF(OR($E45=\"-\",$G45=\"-\",$L46<=0,$J$54=\"No\",$AA$6=\"NO\"),\"\",VLOOKUP($E45,'Data source'!$B$12:$I$99,8,FALSE))","v":""},{"$f":"IF(OR($E45=\"-\",$G45=\"-\",$L46<=0,$J$54=\"No\",$AA$6=\"NO\"),\"\",(AP46/100*AN46)*($Y46/$Y$50))","v":""},null,{"$f":"IF(OR($E45=\"-\",$G45=\"-\",$L46<=0,$J$54=\"No\",$AA$6=\"NO\"),\"\",VLOOKUP($E45,'Data source'!$B$15:$M$99,12,FALSE))","v":""},{"$f":"IF(OR($E45=\"-\",$G45=\"-\",$L46<=0,$J$54=\"No\",$AA$6=\"NO\"),\"\",IF($AS46=\"Dry\",$O45/$X46/10,IF($AS46=\"Wet\",$O45/($AA46/100)*$X46/10,0)))","v":""},{"$f":"IF(OR($E45=\"-\",$G45=\"-\",$L46<=0,$J$54=\"No\",$AA$6=\"NO\"),\"\",IF(OR($H32=\"-\",$Q46=\"-\",$L46=0),\"\",AT46/Z46))","v":""},{"$f":"IF(OR($E45=\"-\",$G45=\"-\",$L46<=0,$J$54=\"No\",$AA$6=\"NO\"),\"\",IF(OR($H32=\"-\",$Q46=\"-\",$L46=0),\"\",($AT46*$L46)/100))","v":""},null,null,null,{"$f":"IF(OR($E45=\"-\",$G45=\"-\",$L46<=0,$J$54=\"No\",$AA$6=\"NO\"),\"\",VLOOKUP($E45,'Data source'!$B$15:$M$99,9,FALSE))","v":""},null,{"$f":"IF(OR($E45=\"-\",$G45=\"-\",$L46<=0,$J$54=\"No\",$AA$6=\"NO\"),\"\",VLOOKUP($E45,'Data source'!$B$15:$M$99,10,FALSE))","v":""},null,{"$f":"IF(OR($E45=\"-\",$G45=\"-\",$L46<=0,$J$54=\"No\",$AA$6=\"NO\"),\"\",VLOOKUP($E45,'Data source'!$B$15:$M$99,11,FALSE))","v":""},null,null,null,{"$f":"IF(OR($E45=\"-\",$G45=\"-\",$L46<=0,$J$54=\"No\",$AA$6=\"NO\"),0,VLOOKUP($E45,'Data source'!$B$15:$T$99,13,FALSE))","v":0},{"$f":"IF(OR($E45=\"-\",$G45=\"-\",$L46<=0,$J$54=\"No\",$AA$6=\"NO\"),0,VLOOKUP($E45,'Data source'!$B$15:$T$99,14,FALSE))","v":0},{"$f":"IF(OR($E45=\"-\",$G45=\"-\",$L46<=0,$J$54=\"No\",$AA$6=\"NO\"),0,VLOOKUP($E45,'Data source'!$B$15:$T$99,15,FALSE))","v":0},{"$f":"IF(OR($E45=\"-\",$G45=\"-\",$L46<=0,$J$54=\"No\",$AA$6=\"NO\"),0,VLOOKUP($E45,'Data source'!$B$15:$T$99,16,FALSE))","v":0},{"$f":"IF(OR($E45=\"-\",$G45=\"-\",$L46<=0,$J$54=\"No\",$AA$6=\"NO\"),0,VLOOKUP($E45,'Data source'!$B$15:$T$99,17,FALSE))","v":0},{"$f":"IF(OR($E45=\"-\",$G45=\"-\",$L46<=0,$J$54=\"No\",$AA$6=\"NO\"),0,VLOOKUP($E45,'Data source'!$B$15:$T$99,18,FALSE))","v":0},{"$f":"IF(OR($E45=\"-\",$G45=\"-\",$L46<=0,$J$54=\"No\",$AA$6=\"NO\"),0,VLOOKUP($E45,'Data source'!$B$15:$T$99,19,FALSE))","v":0},{"$f":"IF(OR($E45=\"-\",$G45=\"-\",$L46<=0,$J$54=\"No\",$AA$6=\"NO\"),0,((43.498*$BH46)+(25.574*$BI46))-((28.206*$BJ46)+(62.375*$BK46)))*$Y46*10/1000","v":0},null,null,null,null,null,null,null,null,null,null,{"$f":"IF($AZ46=\"\",0,$AZ46*$AE46)","v":0},{"$f":"IF($BB46=\"\",0,$BB46*$AE46)","v":0},{"$f":"IF($BD46=\"\",0,$BD46*$AE46)","v":0}]
[]
[null,null,null,null,null,null,null,null,null,"KgDM/cow",null,"KgDM/cow"]
[null,null,null,null,null,null,"Total kg DM offered:  Option 1",null,null,{"$f":"IF($J$53=\"No\",\"\",SUM(R27,R30,R33,R36,R39,R42,R45))","v":""},null,null,null,null,null,null,null,null,null,null,null,null,"OPTION 1",null,{"$f":"IF($J$53=\"No\",\"\",SUM(Y27,Y30,Y33,Y36,Y39,Y42,Y45))","v":""},null,null,{"$f":"IF($J$53=\"No\",\"\",SUM(AB27,AB30,AB33,AB36,AB39,AB42,AB45))","v":""},null,null,{"$f":"IF($J$53=\"No\",\"\",SUM(AE27,AE30,AE33,AE36,AE39,AE42,AE45))","v":""},null,null,{"$f":"IF($J$53=\"No\",\"\",SUM(AH27,AH30,AH33,AH36,AH39,AH42,AH45))","v":""},null,null,{"$f":"IF($J$53=\"No\",\"\",SUM(AK27,AK30,AK33,AK36,AK39,AK42,AK45))","v":""},null,null,{"$f":"IF($J$53=\"No\",\"\",SUM(AN27,AN30,AN33,AN36,AN39,AN42,AN45))","v":""},null,null,{"$f":"IF($J$53=\"No\",\"\",SUM(AQ27,AQ30,AQ33,AQ36,AQ39,AQ42,AQ45))","v":""},null,"$/mob",{"$f":"AV49*$O$6","v":{"$error":"#VALUE!"}},"$/cow",{"$f":"IF($J$53=\"No\",\"\",SUM(AV27,AV30,AV33,AV36,AV39,AV42,AV45))","v":""},null,null,null,{"$f":"IF($J$53=\"No\",\"\",SUM(BZ27,BZ30,BZ33,BZ36,BZ39,BZ42,BZ45)/AE49)","v":""},null,{"$f":"IF($J$53=\"No\",\"\",SUM(CA27,CA30,CA33,CA36,CA39,CA42,CA45)/AE49)","v":""},null,{"$f":"IF($J$53=\"No\",\"\",SUM(CB27,CB30,CB33,CB36,CB39,CB42,CB45)/AE49)","v":""},null,null,null,{"$f":"IF($J$53=\"No\",\"\",IF((SUM(BH27,BH30,BH33,BH36,BH39,BH42,BH45))>0,SUM(BH27,BH30,BH33,BH36,BH39,BH42,BH45)/$Y$49,\"\"))","v":""},"","","","","","",{"$f":"IF($J$53=\"No\",\"\",SUM(BO27,BO30,BO33,BO36,BO39,BO42,BO45))","v":""}]
[null,null,null,null,null,null,null," Option 2",null,null,null,{"$f":"IF($J$54=\"No\",\"\",SUM(R28,R31,R34,R37,R40,R43,R46))","v":""},null,null,null,null,null,null,null,null,null,null,"OPTION 2",null,{"$f":"IF($J$54=\"No\",\"\",SUM(Y28,Y31,Y34,Y37,Y40,Y43,Y46))","v":""},null,null,{"$f":"IF($J$54=\"No\",\"\",SUM(AB28,AB31,AB34,AB37,AB40,AB43,AB46))","v":""},null,null,{"$f":"IF($J$54=\"No\",\"\",SUM(AE28,AE31,AE34,AE37,AE40,AE43,AE46))","v":""},null,null,{"$f":"IF($J$54=\"No\",\"\",SUM(AH28,AH31,AH34,AH37,AH40,AH43,AH46))","v":""},null,null,{"$f":"IF($J$54=\"No\",\"\",SUM(AK28,AK31,AK34,AK37,AK40,AK43,AK46))","v":""},null,null,{"$f":"IF($J$54=\"No\",\"\",SUM(AN28,AN31,AN34,AN37,AN40,AN43,AN46))","v":""},null,null,{"$f":"IF($J$54=\"No\",\"\",SUM(AQ28,AQ31,AQ34,AQ37,AQ40,AQ43,AQ46))","v":""},null,null,{"$f":"AV50*O6","v":{"$error":"#VALUE!"}},null,{"$f":"IF($J$54=\"No\",\"\",SUM(AV28,AV31,AV34,AV37,AV40,AV43,AV46))","v":""},null,null,null,{"$f":"IF($J$54=\"No\",\"\",SUM(BZ28,BZ31,BZ34,BZ37,BZ40,BZ43,BZ46)/AE50)","v":""},null,{"$f":"IF($J$54=\"No\",\"\",SUM(CA28,CA31,CA34,CA37,CA40,CA43,CA46)/AE50)","v":""},null,{"$f":"IF($J$54=\"No\",\"\",SUM(CB28,CB31,CB34,CB37,CB40,CB43,CB46)/AE50)","v":""},null,null,null,{"$f":"IF($J$54=\"No\",\"\",IF((SUM(BH28,BH31,BH34,BH37,BH40,BH43,BH46))>0,SUM(BH28,BH31,BH34,BH37,BH40,BH43,BH46)/$Y$50,\"\"))","v":""},"","","","","","",{"$f":"IF($J$53=\"No\",\"\",SUM(BO28,BO31,BO34,BO37,BO40,BO43,BO46))","v":""}]
[]
[null,null,null,null,null,null,null,null,null,null,null,null,null,null,null,null,null,null,null,null,null,"WARNINGS"]
[null,null,null,null,null,null,null,"All MOB and PASTURE inputs complete?","Option 1",{"$f":"IF(OR($G$6=\"-\",$G$7=\"-\",$G$8=\"-\",$G$9=\"-\",$G$10=\"\",$O$6=\"\",$O$7=\"\",$O$8=\"-\",$O$9=\"-\",$G$14=\"-\",$G$27=\"-\"),\"No\",\"Yes\")","v":"No"},null,null,null,null,null,null,null,null,null,null,null,null,"DM",null,{"$f":"IF(Z53=\"Dry matter intake is less than required\",\"Opt.1\",\"\")","v":""},{"$f":"IF($J$53=\"Yes\",IF($Z$17<-0.5,\"Dry matter intake is less than required\",\" \"),\"\")","v":""}]
[null,null,null,null,null,null,null,null,"Option 2",{"$f":"IF(OR($G$6=\"-\",$G$7=\"-\",$G$8=\"-\",$G$9=\"-\",$G$10=\"\",$O$6=\"\",$O$7=\"\",$O$8=\"-\",$O$9=\"-\",$G$14=\"-\",$G$27=\"-\",$L$28<=0),\"No\",\"Yes\")","v":"No"},null,null,null,null,null,null,null,null,null,null,null,null,null,null,{"$f":"IF(Z54=\"Dry matter intake is less than required\",\"Opt.2\",\"\")","v":""},{"$f":"IF(AND($J$54=\"Yes\",$AA$6=\"YES\"),IF(OR($Z$19<-0.5),\"Dry matter intake is less than required\",\" \"),\"\")","v":""}]
[null,null,null,null,null,null,null,null,null,null,null,null,null,null,null,null,null,null,null,null,null,null,"Protein",null,{"$f":"IF(Z55=\"Protein levels are below recommended values; however, consider costs and benefits before adding additional protein\",\"Opt.1\",\"\")","v":""},{"$f":"IF($J$53=\"Yes\",IF($AE$16<$AE$14,\"Protein levels are below recommended values; however, consider costs and benefits before adding additional protein\",\" \"),\"\")","v":""}]
[null,null,null,null,null,null,null,null,null,null,null,null,null,null,null,null,null,null,null,null,null,null,null,null,{"$f":"IF(Z56=\"Protein levels are below recommended values; however, consider costs and benefits before adding additional protein\",\"Opt.2\",\"\")","v":""},{"$f":"IF(AND($J$54=\"Yes\",$AA$6=\"YES\"),IF($AE$18<$AE$14,\"Protein levels are below recommended values; however, consider costs and benefits before adding additional protein\",\" \"),\"\")","v":""}]
[null,null,null,null,null,null,null,null,null,null,null,null,null,null,null,null,null,null,null,null,null,null,"NDF",null,{"$f":"IF(Z57=\"Neutral detergent fibre levels are below recommended value. Add more fibre to the diet (e.g. silage/pasture) or reduce starch based supplements\",\"Opt.1\",\"\")","v":""},{"$f":"IF($J$53=\"Yes\",IF($AH$16<=35,\"Neutral detergent fibre levels are below recommended value. Add more fibre to the diet (e.g. silage/pasture) or reduce starch based supplements\",\" \"),\"\")","v":""}]
[null,null,null,null,null,null,null,null,null,null,null,null,null,null,null,null,null,null,null,null,null,null,null,null,{"$f":"IF(Z58=\"Neutral detergent fibre levels are below recommended value. Add more fibre to the diet (e.g. silage/pasture) or reduce starch based supplements\",\"Opt.2\",\"\")","v":""},{"$f":"IF(AND($J$54=\"Yes\",$AA$6=\"YES\"),IF($AH$18<=35,\"Neutral detergent fibre levels are below recommended value. Add more fibre to the diet (e.g. silage/pasture) or reduce starch based supplements\",\" \"),\"\")","v":""}]
[null,null,null,null,null,null,null,null,null,null,null,null,null,null,null,null,null,null,null,null,null,null,"SS",null,{"$f":"IF(Z59=\"Soluble sugar and starch levels are greater than reccomended. Reduce supplements high in starch or sugars (e.g. barley/maize grain\",\"Opt.1\",\"\")","v":""},{"$f":"IF($J$53=\"Yes\",IF($AK$16>=38,\"Soluble sugar and starch levels are greater than reccomended. Reduce supplements high in starch or sugars (e.g. barley/maize grain\",\" \"),\"\")","v":""}]
[null,null,null,null,null,null,null,null,null,null,null,null,null,null,null,null,null,null,null,null,null,null,null,null,{"$f":"IF(Z60=\"Soluble sugar and starch levels are greater than reccomended. Reduce supplements high in starch or sugars (e.g. barley/maize grain\",\"Opt.2\",\"\")","v":""},{"$f":"IF(AND($J$54=\"Yes\",$AA$6=\"YES\"),IF($AK$18>=38,\"Soluble sugar and starch levels are greater than reccomended. Reduce supplements high in starch or sugars (e.g. barley/maize grain\",\" \"),\"\")","v":""}]
[null,null,null,null,null,null,null,null,null,null,null,null,null,null,null,null,null,null,null,null,null,null,"Starch",null,{"$f":"IF(Z61=\"Starch levels in the diet are greater than reccomended. Reduce supplements that are high in starch (e.g. barley or wheat)\",\"Opt.1\",\"\")","v":""},{"$f":"IF($J$53=\"Yes\",IF(AN16>=30,\"Starch levels in the diet are greater than reccomended. Reduce supplements that are high in starch (e.g. barley or wheat)\",\" \"),\"\")","v":""}]
[null,null,null,null,null,null,null,null,null,null,null,null,null,null,null,null,null,null,null,null,null,null,null,null,{"$f":"IF(Z62=\"Starch levels in the diet are greater than reccomended. Reduce supplements that are high in starch (e.g. barley or wheat)\",\"Opt.2\",\"\")","v":""},{"$f":"IF(AND($J$54=\"Yes\",$AA$6=\"YES\"),IF(AN18>=30,\"Starch levels in the diet are greater than reccomended. Reduce supplements that are high in starch (e.g. barley or wheat)\",\" \"),\"\")","v":""}]
[null,null,null,null,null,null,null,null,null,null,null,null,null,null,null,null,null,null,null,null,null,null,"Fat",null,{"$f":"IF(Z63=\"Fat levels in the diet are greater than reccomended. Reduce feeds high in unsaturated fats (e.g. sunflower oil)\",\"Opt.1\",\"\")","v":""},{"$f":"IF(AND($J$54=\"Yes\",$AA$6=\"YES\"),IF(AQ16>=6,\"Fat levels in the diet are greater than reccomended. Reduce feeds high in unsaturated fats (e.g. sunflower oil)\",\" \"),\"\")","v":""}]
[null,null,null,null,null,null,null,null,null,null,null,null,null,null,null,null,null,null,null,null,null,null,null,null,{"$f":"IF(Z64=\"Fat levels in the diet are greater than reccomended. Reduce feeds high in unsaturated fats (e.g. sunflower oil)\",\"Opt.2\",\"\")","v":""},{"$f":"IF($J$54=\"Yes\",IF(AQ18>=6,\"Fat levels in the diet are greater than reccomended. Reduce feeds high in unsaturated fats (e.g. sunflower oil)\",\" \"),\"\")","v":""}]
[]
[null,null,null,null,null,null,null,null,null,null,null,null,null,null,null,null,null,null,null,null,null,{"$f":"IF($AA$8=\"YES\",\"TOTAL PROTEIN\",\"\")","v":"TOTAL PROTEIN"},null,null,null,null,{"$f":"IF(OR(AF16<AF14,AF18<AF14),\"Protein levels are below recommended values; however, it is often not economical to use an expensive protein supplement.  See Example in Extra Info  tab\",\" \")","v":" "}]
[null,null,null,null,null,null,null,null,null,null,null,null,null,null,null,null,null,null,null,null,null,null,{"$f":"IF($AA$8=\"YES\",\"UDP\",\"\")","v":"UDP"},null,{"$f":"IF(OR(Z67=\"Check that data in Data Source is complete, UDP + RDP should = 100% \",Z67=\"UDP levels are below recommended values; however, other factors such as passage rate and total dietary protein content need to be taken into account.  See FeedRight TechNote 15 for more information\"),\"Opt.1\",\"\")","v":""},{"$f":"IF($J$53=\"Yes\",IF(($AZ$49+$BD$49)<100,\"Check that data in Data Source is complete, UDP + RDP should = 100% \",IF(AZ49<=35,\"UDP levels are below recommended values; however, other factors such as passage rate and total dietary protein content need to be taken into account.  See FeedRight TechNote 15 for more information\",\"\")),\"\")","v":""}]
[null,null,null,null,null,null,null,null,null,null,null,null,null,null,null,null,null,null,null,null,null,null,null,null,{"$f":"IF(OR(Z68=\"Check that data in Data Source is complete, UDP + RDP should = 100% \",Z68=\"UDP levels are below recommended values; however, other factors such as passage rate and total dietary protein content need to be taken into account.  See FeedRight TechNote 15 for more information\"),\"Opt.2\",\"\")","v":""},{"$f":"IF(AND($J$54=\"Yes\",$AA$6=\"YES\"),IF(($AZ$50+$BD$50)<100,\"Check that data in Data Source is complete, UDP + RDP should = 100% \",IF($AZ$50<=35,\"UDP levels are below recommended values; however, other factors such as passage rate and total dietary protein content need to be taken into account.  See FeedRight TechNote 15 for more information\",\"\")),\"\")","v":""}]
[null,null,null,null,null,null,null,null,null,null,null,null,null,null,null,null,null,null,null,null,null,null,{"$f":"IF($AA$8=\"YES\",\"Soluble\",\"\")","v":"Soluble"},null,{"$f":"IF(OR(Z69=\"Check that data in Data Source is complete, UDP + RDP should = 100% \",Z69=\"Soluble protein levels are below recommended values; however, other factors such as passage rate and total dietary protein content need to be taken into account.  See FeedRight TechNote 15 for more information\"),\"Opt.1\",\"\")","v":""},{"$f":"IF($J$53=\"Yes\",IF(($AZ$49+$BD$49)<100,\"Check that data in Data Source is complete, UDP + RDP should = 100% \",IF(BB49<=32,\"Soluble protein levels are below recommended values; however, other factors such as passage rate and total dietary protein content need to be taken into account.  See FeedRight TechNote 15 for more information\",\"\")),\"\")","v":""}]
[null,null,null,null,null,null,null,null,null,null,null,null,null,null,null,null,null,null,null,null,null,null,null,null,{"$f":"IF(OR(Z70=\"Check that data in Data Source is complete, UDP + RDP should = 100% \",Z70=\"Soluble protein levels are below recommended values; however, other factors such as passage rate and total dietary protein content need to be taken into account.  See FeedRight TechNote 15 for more information\"),\"Opt.2\",\"\")","v":""},{"$f":"IF(AND($J$54=\"Yes\",$AA$6=\"YES\"),IF(($AZ$50+$BD$50)<100,\"Check that data in Data Source is complete, UDP + RDP should = 100% \",IF(BB50<=32,\"Soluble protein levels are below recommended values; however, other factors such as passage rate and total dietary protein content need to be taken into account.  See FeedRight TechNote 15 for more information\",\"\")),\"\")","v":""}]
[null,null,null,null,null,null,null,null,null,null,null,null,null,null,null,null,null,null,null,null,null,null,{"$f":"IF($AA$8=\"YES\",\"RDP\",\"\")","v":"RDP"},null,{"$f":"IF(OR(Z71=\"Check that data in Data Source is complete, UDP + RDP should = 100% \",Z71=\"RDP levels are above recommended values; however, other factors such as passage rate and total dietary protein content need to be taken into account before dietary changes are made.  See FeedRight TechNote 15 for more information\"),\"Opt.1\",\"\")","v":""},{"$f":"IF($J$53=\"Yes\",IF(($AZ$49+$BD$49)<100,\"Check that data in Data Source is complete, UDP + RDP should = 100% \",IF($BD$49>=65,\"RDP levels are above recommended values; however, other factors such as passage rate and total dietary protein content need to be taken into account before dietary changes are made.  See FeedRight TechNote 15 for more information\",\"\")),\"\")","v":""}]
[null,null,null,null,null,null,null,null,null,null,null,null,null,null,null,null,null,null,null,null,null,null,null,null,{"$f":"IF(OR(Z72=\"Check that data in Data Source is complete, UDP + RDP should = 100% \",Z72=\"RDP levels are above recommended values; however, other factors such as passage rate and total dietary protein content need to be taken into account before dietary changes are made.  See FeedRight TechNote 15 for more information\"),\"Opt.2\",\"\")","v":""},{"$f":"IF(AND($J$54=\"Yes\",$AA$6=\"YES\"),IF(($AZ$50+$BD$50)<100,\"Check that data in Data Source is complete, UDP + RDP should = 100% \",IF($BD$50>=65,\"RDP levels are above recommended values; however, other factors such as passage rate and total dietary protein content need to be taken into account before dietary changes are made.  See FeedRight TechNote 15 for more information\",\"\")),\"\")","v":""}]
[null,null,null,null,null,null,null,null,null,null,null,null,null,null,null,null,null,null,null,null,null,{"$f":"IF($AA$8=\"YES\",\"RDP = rumen degradable protein\",\"\")","v":"RDP = rumen degradable protein"}]
[null,null,null,null,null,null,null,null,null,null,null,null,null,null,null,null,null,null,null,null,null,{"$f":"IF($AA$8=\"YES\",\"UDP =unegradable dietary protein\",\"\")","v":"UDP =unegradable dietary protein"}]

{"sheet":"SUMMARISE 2","index":6,"n_rows":34,"n_cols":24,"rows_kept":34,"cut":false,"hidden":true,"merged":[[28,22,28,23],[4,20,4,21],[4,22,4,23]]}
[]
[]
[null,"FARM & MOB INFO"]
[]
[null,null,"FARM",null,null,null,null,null,null,"FEED TYPE",null,"FEED",null,null,null,"FEEDING METHOD",null,null,null,"ON-HAND","OPTION 1",null,"OPTION 2"]
[null,null,"Platform Sixe (Effective ha)",null,null,null,{"$f":"IF('   ASK    '!E8=\"\",\"-\",'   ASK    '!E8)","v":100},null,null,null,null,null,null,null,null,null,null,null,null,null,"kg DM","Tonne","kg DM","Tonne"]
[null,null,{"$f":"FEEDCHECKER!J8","v":"Terrain"},null,null,null,{"$f":"IF('   ASK    '!E11=\"\",\"-\",'   ASK    '!E11)","v":"flat"},null,null,null,null,null,null,null,null,null,null,null,null,null,"cow/day","mob/day","cow/day","mob/day"]
[null,null,"Current total grazable area (ha)",null,null,null,null,null,null,{"$f":"IF(FEEDCHECKER!C41=\"\",\"-\",FEEDCHECKER!C41)","v":"PASTURE"},null,{"$f":"IF(FEEDCHECKER!E41=\"\",\"-\",FEEDCHECKER!E41)","v":"-"},null,null,null,{"$f":"IF(FEEDCHECKER!H41=\"\",\"-\",FEEDCHECKER!H41)","v":"-"},null,null,null,"Tonne",{"$f":"IF(FEEDCHECKER!K41=\"\",\"-\",FEEDCHECKER!K41)","v":"-"},{"$f":"IF($P$8=\"-\",\"-\",($G$22*$U8)/1000)","v":"-"},{"$f":"IF(FEEDCHECKER!O41=\"\",\"-\",FEEDCHECKER!O41)","v":"-"},{"$f":"IF($P$8=\"-\",\"-\",($G$22*$U8)/1000)","v":"-"}]
[null,null,"Area grazed/day (ha - all mobs)",null,null,null,null,null,null,{"$f":"IF(FEEDCHECKER!C44=\"\",\"-\",FEEDCHECKER!C44)","v":"-"},null,{"$f":"IF(FEEDCHECKER!E44=\"\",\"-\",FEEDCHECKER!E44)","v":"-"},null,null,null,{"$f":"IF(FEEDCHECKER!H44=\"\",\"-\",FEEDCHECKER!H44)","v":"-"},null,null,null,null,{"$f":"IF(FEEDCHECKER!K44=\"\",\"-\",FEEDCHECKER!K44)","v":"-"},{"$f":"IF($P$9=\"-\",\"-\",($G$22*$U9)/1000)","v":"-"},{"$f":"IF(FEEDCHECKER!O44=\"\",\"-\",FEEDCHECKER!O44)","v":"-"},{"$f":"IF($P$9=\"-\",\"-\",($G$22*$W9)/1000)","v":"-"}]
[null,null,"Average pasture cover  (kg DM/ha)",null,null,null,null,null,null,{"$f":"IF(FEEDCHECKER!C47=\"\",\"-\",FEEDCHECKER!C47)","v":"-"},null,{"$f":"IF(FEEDCHECKER!E47=\"\",\"-\",FEEDCHECKER!E47)","v":"-"},null,null,null,{"$f":"IF(FEEDCHECKER!H47=\"\",\"-\",FEEDCHECKER!H47)","v":"-"},null,null,null,null,{"$f":"IF(FEEDCHECKER!K47=\"\",\"-\",FEEDCHECKER!K47)","v":"-"},{"$f":"IF($P$10=\"-\",\"-\",($G$22*$U10)/1000)","v":"-"},{"$f":"IF(FEEDCHECKER!O47=\"\",\"-\",FEEDCHECKER!O47)","v":"-"},{"$f":"IF($P$10=\"-\",\"-\",($G$22*$W10)/1000)","v":"-"}]
[null,null,null,null,null,null,null,null,null,{"$f":"IF(FEEDCHECKER!C59=\"\",\"-\",FEEDCHECKER!C59)","v":"-"},null,{"$f":"IF(FEEDCHECKER!E59=\"\",\"-\",FEEDCHECKER!E59)","v":"-"},null,null,null,{"$f":"IF(FEEDCHECKER!H59=\"\",\"-\",FEEDCHECKER!H59)","v":"-"},null,null,null,null,{"$f":"IF(FEEDCHECKER!K59=\"\",\"-\",FEEDCHECKER!K59)","v":"-"},{"$f":"IF($P$11=\"-\",\"-\",($G$22*$U11)/1000)","v":"-"},{"$f":"IF(FEEDCHECKER!O59=\"\",\"-\",FEEDCHECKER!O59)","v":"-"},{"$f":"IF($P$11=\"-\",\"-\",($G$22*$W11)/1000)","v":"-"}]
[null,null,"HERD",null,null,null,null,null,null,{"$f":"IF(FEEDCHECKER!C62=\"\",\"-\",FEEDCHECKER!C62)","v":"-"},null,{"$f":"IF(FEEDCHECKER!E62=\"\",\"-\",FEEDCHECKER!E62)","v":"-"},null,null,null,{"$f":"IF(FEEDCHECKER!H62=\"\",\"-\",FEEDCHECKER!H62)","v":"-"},null,null,null,null,{"$f":"IF(FEEDCHECKER!K62=\"\",\"-\",FEEDCHECKER!K62)","v":"-"},{"$f":"IF($P$12=\"-\",\"-\",($G$22*$U12)/1000)","v":"-"},{"$f":"IF(FEEDCHECKER!O62=\"\",\"-\",FEEDCHECKER!O62)","v":"-"},{"$f":"IF($P$12=\"-\",\"-\",($G$22*$W12)/1000)","v":"-"}]
[null,null,"Breed",null,null,null,null,null,null,{"$f":"IF(FEEDCHECKER!C65=\"\",\"-\",FEEDCHECKER!C65)","v":"-"},null,{"$f":"IF(FEEDCHECKER!E65=\"\",\"-\",FEEDCHECKER!E65)","v":"-"},null,null,null,{"$f":"IF(FEEDCHECKER!H65=\"\",\"-\",FEEDCHECKER!H65)","v":"-"},null,null,null,null,{"$f":"IF(FEEDCHECKER!K65=\"\",\"-\",FEEDCHECKER!K65)","v":"-"},{"$f":"IF($P$13=\"-\",\"-\",($G$22*$U13)/1000)","v":"-"},{"$f":"IF(FEEDCHECKER!O65=\"\",\"-\",FEEDCHECKER!O65)","v":"-"},{"$f":"IF($P$13=\"-\",\"-\",($G$22*$W13)/1000)","v":"-"}]
[null,null,"Average liveweight (kg)",null,null,null,null,null,null,{"$f":"IF(FEEDCHECKER!C68=\"\",\"-\",FEEDCHECKER!C68)","v":"-"},null,{"$f":"IF(FEEDCHECKER!E68=\"\",\"-\",FEEDCHECKER!E68)","v":"-"},null,null,null,{"$f":"IF(FEEDCHECKER!H68=\"\",\"-\",FEEDCHECKER!H68)","v":"-"},null,null,null,null,{"$f":"IF(FEEDCHECKER!K68=\"\",\"-\",FEEDCHECKER!K68)","v":"-"},{"$f":"IF($P$14=\"-\",\"-\",($G$22*$U14)/1000)","v":"-"},{"$f":"IF(FEEDCHECKER!O68=\"\",\"-\",FEEDCHECKER!O68)","v":"-"},{"$f":"IF($P$14=\"-\",\"-\",($G$22*$W14)/1000)","v":"-"}]
[null,null,"Number of cows at peak"]
[null,null,"Number of cows on farm now",null,null,null,null,null,null,null,null,null,null,null,null,null,null,"Offered (kg DM)",null,null,{"$f":"IF(FEEDCHECKER!K72=\"\",\"-\",FEEDCHECKER!K72)","v":0},{"$f":"IF($U16=\"-\",\"-\",($G$22*$U16)/1000)","v":{"$error":"#VALUE!"}},{"$f":"IF(FEEDCHECKER!O72=\"\",\"-\",FEEDCHECKER!O72)","v":"-"},{"$f":"IF($W16=\"-\",\"-\",($G$22*$W16)/1000)","v":"-"}]
[null,null,{"$f":"FEEDCHECKER!C7","v":"Stage of lactation"},null,null,null,null,null,null,null,null,null,null,null,null,null,null,"Eaten",null,null,{"$f":"IF(FEEDCHECKER!AX72=\"\",\"-\",FEEDCHECKER!AX72)","v":"-"},{"$f":"IF($U17=\"-\",\"-\",($G$22*$U17)/1000)","v":"-"},{"$f":"IF(FEEDCHECKER!AX73=\"\",\"-\",FEEDCHECKER!AX73)","v":"-"},{"$f":"IF($W17=\"-\",\"-\",($G$22*$W17)/1000)","v":"-"}]
[null,null,"BSC (herd average)"]
[null,null,{"$f":"FEEDCHECKER!C10","v":"Date of next calving (PSC)"}]
[]
[null,null,"COWS IN THIS MOB",null,null,null,null,null,"PASTURE",null,null,null,"ALLOCATION",null,null,"SUMMARY METRICS"]
[null,null,{"$f":"FEEDCHECKER!J6","v":"Cows in mob"},null,null,null,{"$f":"IF(FEEDCHECKER!O6=\"\",\"-\",FEEDCHECKER!O6)","v":"-"},null,"Pasture MJME/kg DM",null,null,null,{"$f":"IF(FEEDCHECKER!AY40=\"\",\"-\",FEEDCHECKER!AY40)","v":"-"},null,null,"Stocking rate at peak (cows/ha)",null,null,null,null,null,"Rotation length"]
[null,null,{"$f":"FEEDCHECKER!J7","v":"Milk solids (kg MS/cow/day)"},null,null,null,{"$f":"IF(FEEDCHECKER!O7=\"\",\"-\",FEEDCHECKER!O7)","v":"-"},null,{"$f":"IF('ASSESS & COMPARE'!C15=\"\",\"-\",'ASSESS & COMPARE'!C15)","v":"Pre-grazing cover "},null,null,null,{"$f":"IF(FEEDCHECKER!O14=\"\",\"-\",FEEDCHECKER!O14)","v":"-"},null,null,"kg LWT/ha",null,null,null,null,null,"Weeks until PSC"]
[null,null,"Est, BCS loss next month",null,null,null,{"$f":"IF(FEEDCHECKER!H9=\"\",\"-\",FEEDCHECKER!H9)","v":"-"},null,{"$f":"IF('ASSESS & COMPARE'!C16=\"\",\"-\",'ASSESS & COMPARE'!C16)","v":"Post-grazing residual "},null,null,null,{"$f":"IF(FEEDCHECKER!O15=\"\",\"-\",FEEDCHECKER!O15)","v":"-"},null,null,"Current Stocking rate (cows/ha)"]
[null,null,"Total daily walking distance (km)",null,null,null,null,null,{"$f":"IF('ASSESS & COMPARE'!C17=\"\",\"-\",'ASSESS & COMPARE'!C17)","v":"Hectares grazed/day  -this mob"},null,null,null,{"$f":"IF(FEEDCHECKER!O16=\"\",\"-\",FEEDCHECKER!O16)","v":"-"},null,null,"Current kg LWT/ha"]
[null,null,"Average liveweight (kg)"]
[null,"DIET CHECK"]
[]
[null,null,null,null,"DM","ME",null,"PROT.","NDF","SSS","STARCH","FAT",null,"Na","K","Cl","S","Mg","Ca","P",null,"DCAD","FEED COST"]
[null,null,"RECOMMENDED",null,{"$f":"IF(FEEDCHECKER!#REF!=\"\",\"-\",FEEDCHECKER!#REF!)","v":{"$error":"#REF!"}},{"$f":"IF(FEEDCHECKER!#REF!=\"\",\"-\",FEEDCHECKER!#REF!)","v":{"$error":"#REF!"}},null,{"$f":"IF(FEEDCHECKER!#REF!=\"\",\"-\",FEEDCHECKER!#REF!)","v":{"$error":"#REF!"}},">35","<38","<30","<6",null,">0.12",">1.2",">0.50",">0.25",">0.30","<0.5,>2.0","0.25-0.45",null,"<0","$/Cow/d","$/Mob/d"]
[]
[null,null,"CURRENT",null,{"$f":"IF(FEEDCHECKER!#REF!=\"\",\"-\",FEEDCHECKER!#REF!)","v":{"$error":"#REF!"}},{"$f":"IF(FEEDCHECKER!#REF!=\"\",\"-\",FEEDCHECKER!#REF!)","v":{"$error":"#REF!"}},null,{"$f":"IF(FEEDCHECKER!#REF!=\"\",\"-\",FEEDCHECKER!#REF!)","v":{"$error":"#REF!"}},{"$f":"IF(FEEDCHECKER!#REF!=\"\",\"-\",FEEDCHECKER!#REF!)","v":{"$error":"#REF!"}},{"$f":"IF(FEEDCHECKER!#REF!=\"\",\"-\",FEEDCHECKER!#REF!)","v":{"$error":"#REF!"}},{"$f":"IF(FEEDCHECKER!#REF!=\"\",\"-\",FEEDCHECKER!#REF!)","v":{"$error":"#REF!"}},{"$f":"IF(FEEDCHECKER!#REF!=\"\",\"-\",FEEDCHECKER!#REF!)","v":{"$error":"#REF!"}},null,{"$f":"FEEDCHECKER!#REF!","v":{"$error":"#REF!"}},{"$f":"FEEDCHECKER!#REF!","v":{"$error":"#REF!"}},{"$f":"FEEDCHECKER!#REF!","v":{"$error":"#REF!"}},{"$f":"FEEDCHECKER!#REF!","v":{"$error":"#REF!"}},{"$f":"FEEDCHECKER!#REF!","v":{"$error":"#REF!"}},{"$f":"FEEDCHECKER!#REF!","v":{"$error":"#REF!"}},{"$f":"FEEDCHECKER!#REF!","v":{"$error":"#REF!"}},null,{"$f":"IF(FEEDCHECKER!$BT$9=\"YES\",FEEDCHECKER!#REF!,\"\")","v":""},{"$f":"IF(FEEDCHECKER!$Q$35=\"YES\",FEEDCHECKER!#REF!,\"\")","v":""},{"$f":"IF(FEEDCHECKER!$Q$35=\"YES\",FEEDCHECKER!AQ72,\"\")","v":""}]
[]
[null,null,"PROPOSED",null,{"$f":"IF(FEEDCHECKER!#REF!=\"\",\"-\",FEEDCHECKER!#REF!)","v":{"$error":"#REF!"}},{"$f":"IF(FEEDCHECKER!#REF!=\"\",\"-\",FEEDCHECKER!#REF!)","v":{"$error":"#REF!"}},null,{"$f":"IF(FEEDCHECKER!#REF!=\"\",\"-\",FEEDCHECKER!#REF!)","v":{"$error":"#REF!"}},{"$f":"IF(FEEDCHECKER!#REF!=\"\",\"-\",FEEDCHECKER!#REF!)","v":{"$error":"#REF!"}},{"$f":"IF(FEEDCHECKER!#REF!=\"\",\"-\",FEEDCHECKER!#REF!)","v":{"$error":"#REF!"}},{"$f":"IF(FEEDCHECKER!#REF!=\"\",\"-\",FEEDCHECKER!#REF!)","v":{"$error":"#REF!"}},{"$f":"IF(FEEDCHECKER!#REF!=\"\",\"-\",FEEDCHECKER!#REF!)","v":{"$error":"#REF!"}},null,{"$f":"FEEDCHECKER!#REF!","v":{"$error":"#REF!"}},{"$f":"FEEDCHECKER!#REF!","v":{"$error":"#REF!"}},{"$f":"FEEDCHECKER!#REF!","v":{"$error":"#REF!"}},{"$f":"FEEDCHECKER!#REF!","v":{"$error":"#REF!"}},{"$f":"FEEDCHECKER!#REF!","v":{"$error":"#REF!"}},{"$f":"FEEDCHECKER!#REF!","v":{"$error":"#REF!"}},{"$f":"FEEDCHECKER!BT18","v":0},null,{"$f":"IF(FEEDCHECKER!$BT$9=\"YES\",FEEDCHECKER!#REF!,\"\")","v":""},{"$f":"IF(FEEDCHECKER!$Q$35=\"YES\",FEEDCHECKER!AN72,\"\")","v":""},{"$f":"IF(FEEDCHECKER!$Q$35=\"YES\",FEEDCHECKER!AP79,\"\")","v":""}]

{"sheet":"SUMMARISE","index":7,"n_rows":42,"n_cols":19,"rows_kept":42,"cut":false,"hidden":true,"merged":[[22,8,22,10],[19,15,19,16],[3,15,3,19],[19,13,19,14],[5,16,5,17],[6,16,6,17],[7,16,7,17],[8,16,8,17],[9,16,9,17],[10,16,10,17]]}
[]
[null,"FARM INFO",null,null,"TODAY",{"$f":"'   ASK    '!K2","v":"2022-12-06"},null,"Date for calculations",null,{"$f":"IF('   ASK    '!$Q$2=\"\",$F$2,'   ASK    '!$Q$2)","v":"2022-12-06"}]
[]
[null,null,"FARM",null,null,null,null,"COWS",null,null,null,"PASTURE",null,null,null,"CROPS/FORAGE/SUPPLEMENT on hand/contract"]
[null,null,null,null,null,null,null,null,null,null,null,null,null,null,null,null,null,null,"tonne"]
[null,null,{"$f":"'   ASK    '!E7","v":"PLATFORM SIZE (Effective Ha)"},null,null,{"$f":"IF('   ASK    '!$E$8=\"\",\"-\",'   ASK    '!$E$8)","v":100},null,{"$f":"'   ASK    '!K7","v":"BREED"},null,{"$f":"IF('   ASK    '!$K$8=\"\",\"-\",'   ASK    '!$K$8)","v":"Friesian"},null,{"$f":"'   ASK    '!Q7","v":"CURRENT TOTAL GRAZABLE AREA (ha)"},null,{"$f":"IF('   ASK    '!$Q$8=\"\",\"-\",'   ASK    '!$Q$8)","v":90},null,"Feed 1",{"$f":"IF('   ASK    '!$Y$8=\"\",\"-\",'   ASK    '!$Y$8)","v":"Hay pasture good"},null,{"$f":"IF('   ASK    '!$AA$8=\"\",\"-\",'   ASK    '!$AA$8)","v":14}]
[null,null,{"$f":"'   ASK    '!E10","v":"TERRAIN"},null,null,{"$f":"'   ASK    '!$E$11","v":"flat"},null,{"$f":"'   ASK    '!K10","v":"AVERAGE LIVEWEIGHT"},null,{"$f":"'   ASK    '!$K$11","v":600},null,{"$f":"'   ASK    '!Q10","v":"AREA GRAZED/DAY (ha) all mobs"},null,{"$f":"IF('   ASK    '!$Q$11=\"\",\"-\",'   ASK    '!$Q$11)","v":3},null,"Feed 2",{"$f":"IF('   ASK    '!$Y$11=\"\",\"-\",'   ASK    '!$Y$11)","v":"Barley"},null,{"$f":"IF('   ASK    '!$AA$11=\"\",\"-\",'   ASK    '!$AA$11)","v":10}]
[null,null,{"$f":"'   ASK    '!#REF!","v":{"$error":"#REF!"}},null,null,{"$f":"IF('   ASK    '!#REF!=\"\",\"-\",'   ASK    '!#REF!)","v":{"$error":"#REF!"}},null,{"$f":"'   ASK    '!K13","v":"STAGE OF LACTATION"},null,{"$f":"IF('   ASK    '!$K$14=\"\",\"-\",'   ASK    '!$K$14)","v":"Late"},null,{"$f":"'   ASK    '!Q13","v":"AVERAGE PASTURE COVER"},null,{"$f":"IF('   ASK    '!$Q$14=\"\",\"-\",'   ASK    '!$Q$14)","v":2400},null,"Feed 3",{"$f":"IF('   ASK    '!$Y$14=\"\",\"-\",'   ASK    '!$Y$14)","v":"Chicory"},null,{"$f":"IF('   ASK    '!$AA$14=\"\",\"-\",'   ASK    '!$AA$14)","v":20}]
[null,null,{"$f":"'   ASK    '!E13","v":"PLANNED START OF CALVING (PSC)"},null,null,{"$f":"IF('   ASK    '!$E$14=\"\",\"-\",'   ASK    '!$E$14)","v":"2017-07-01"},null,{"$f":"'   ASK    '!K16","v":"TOTAL COWS (at peak)"},null,{"$f":"IF('   ASK    '!$K$17=\"\",\"-\",'   ASK    '!$K$17)","v":330},null,"MJME",null,{"$f":"IF('ASSESS & COMPARE'!Z27=\"\",\"-\",'ASSESS & COMPARE'!Z27)","v":"-"},null,"Feed 4",{"$f":"IF('   ASK    '!$Y$17=\"\",\"-\",'   ASK    '!$Y$17)","v":"PKE"},null,{"$f":"IF('   ASK    '!$AA$17=\"\",\"-\",'   ASK    '!$AA$17)","v":5}]
[null,null,null,null,null,null,null,{"$f":"'   ASK    '!K19","v":"COWS ON FARM NOW"},null,{"$f":"IF('   ASK    '!$K$20=\"\",\"-\",'   ASK    '!$K$20)","v":280},null,null,null,null,null,"Feed 5",{"$f":"IF('   ASK    '!$Y$20=\"\",\"-\",'   ASK    '!$Y$20)","v":"CaCO3, %DM"},null,{"$f":"IF('   ASK    '!$AA$20=\"\",\"-\",'   ASK    '!$AA$20)","v":0.2}]
[null,null,null,null,null,null,null,{"$f":"'   ASK    '!K22","v":"BCS (herd avg)"},null,{"$f":"IF('   ASK    '!$K$23=\"\",\"-\",'   ASK    '!$K$23)","v":4},null,null,null,null,null,"Feed 6",{"$f":"IF('   ASK    '!$Y$23=\"\",\"-\",'   ASK    '!$Y$23)","v":"Maize grain"},null,{"$f":"IF('   ASK    '!$AA$23=\"\",\"-\",'   ASK    '!$AA$23)","v":8}]
[null,null,null,null,null,null,null,null,null,null,null,null,null,null,null,"Minerals  with conc. supplement  Y/N?",null,null,{"$f":"IF('   ASK    '!$AA$26=\"\",\"-\",'   ASK    '!$AA$26)","v":"NO"}]
[null,null,"STATS"]
[null,null,{"$f":"'   ASK    '!K33","v":"Stocking rate at peak (cows/ha)"},null,null,{"$f":"'   ASK    '!M33","v":3.3},null,{"$f":"'   ASK    '!K34","v":"kg LWT/ha"},null,{"$f":"'   ASK    '!M34","v":1980},null,{"$f":"'   ASK    '!Q34","v":"Weeks until PSC"},{"$f":"'   ASK    '!S34","v":-283.42857142857144}]
[null,null,{"$f":"'   ASK    '!Q33","v":"Rotation length"},null,null,{"$f":"'   ASK    '!S33","v":30},null,{"$f":"'   ASK    '!#REF!","v":{"$error":"#REF!"}},null,{"$f":"'   ASK    '!#REF!","v":{"$error":"#REF!"}}]
[]
[]
[null,"MOB INFO"]
[]
[null,null,"COWS",null,null,"MOB",null,null,"FEED ON HAND/CONTRACT",null,null,null,null,"OPTION 1",null,"OPTION 2"]
[null,null,null,null,null,null,null,null,null,null,null,"Feeding method",null,"kg DM/cow/d","t/mob/d","kg DM/cow/d","t/mob/d"]
[null,null,{"$f":"'ASSESS & COMPARE'!C7","v":"Stage of lactation"},null,null,{"$f":"IF('ASSESS & COMPARE'!G7=\"\",\"-\",'ASSESS & COMPARE'!G7)","v":"Late"},null,null,{"$f":"IF('ASSESS & COMPARE'!E27=\"\",\"-\",'ASSESS & COMPARE'!E27)","v":"Pasture autumn and winter"},null,null,{"$f":"IF('ASSESS & COMPARE'!G27=\"\",\"-\",'ASSESS & COMPARE'!G27)","v":"-"},null,{"$f":"IF('ASSESS & COMPARE'!J27=\"\",\"-\",'ASSESS & COMPARE'!J27)","v":12},{"$f":"IF($N$22=\"-\",\"-\",($F$23*$N$22)/1000)","v":1.8},{"$f":"IF('ASSESS & COMPARE'!L28=\"\",\"-\",'ASSESS & COMPARE'!L28)","v":"-"},{"$f":"IF($P$22=\"-\",\"-\",($F$23*$P$22)/1000)","v":"-"}]
[null,null,{"$f":"'ASSESS & COMPARE'!I6","v":"Cows in mob"},null,null,{"$f":"IF('ASSESS & COMPARE'!O6=\"\",\"-\",'ASSESS & COMPARE'!O6)","v":150},null,null,{"$f":"IF('ASSESS & COMPARE'!E30=\"\",\"-\",'ASSESS & COMPARE'!E30)","v":"Hay pasture good"},null,null,{"$f":"IF('ASSESS & COMPARE'!G30=\"\",\"-\",'ASSESS & COMPARE'!G30)","v":"-"},null,{"$f":"IF('ASSESS & COMPARE'!J30=\"\",\"-\",'ASSESS & COMPARE'!J30)","v":"-"},{"$f":"IF($N$23=\"-\",\"-\",($F$23*$N$23)/1000)","v":"-"},{"$f":"IF('ASSESS & COMPARE'!L31=\"\",\"-\",'ASSESS & COMPARE'!L31)","v":"-"},{"$f":"IF($P$23=\"-\",\"-\",($F$23*$P$23)/1000)","v":"-"}]
[null,null,{"$f":"'ASSESS & COMPARE'!I7","v":"Milk solids (kg MS/cow/day)"},null,null,{"$f":"IF('ASSESS & COMPARE'!O7=\"\",\"-\",'ASSESS & COMPARE'!O7)","v":1.1000000000000001},null,null,{"$f":"IF('ASSESS & COMPARE'!E33=\"\",\"-\",'ASSESS & COMPARE'!E33)","v":"Barley"},null,null,{"$f":"IF('ASSESS & COMPARE'!G33=\"\",\"-\",'ASSESS & COMPARE'!G33)","v":"-"},null,{"$f":"IF('ASSESS & COMPARE'!J33=\"\",\"-\",'ASSESS & COMPARE'!J33)","v":"-"},{"$f":"IF($N$24=\"-\",\"-\",($F$23*$N$24)/1000)","v":"-"},{"$f":"IF('ASSESS & COMPARE'!L34=\"\",\"-\",'ASSESS & COMPARE'!L34)","v":"-"},{"$f":"IF($P$24=\"-\",\"-\",($F$23*$P$24)/1000)","v":"-"}]
[null,null,{"$f":"'ASSESS & COMPARE'!C9","v":"Estimated  BCS loss/gain next month"},null,null,{"$f":"IF('ASSESS & COMPARE'!G9=\"\",\"-\",'ASSESS & COMPARE'!G9)","v":-0.1},null,null,{"$f":"IF('ASSESS & COMPARE'!E36=\"\",\"-\",'ASSESS & COMPARE'!E36)","v":"Chicory"},null,null,{"$f":"IF('ASSESS & COMPARE'!G36=\"\",\"-\",'ASSESS & COMPARE'!G36)","v":"-"},null,{"$f":"IF('ASSESS & COMPARE'!J36=\"\",\"-\",'ASSESS & COMPARE'!J36)","v":"-"},{"$f":"IF($N$25=\"-\",\"-\",($F$23*$N$25)/1000)","v":"-"},{"$f":"IF('ASSESS & COMPARE'!L37=\"\",\"-\",'ASSESS & COMPARE'!L37)","v":"-"},{"$f":"IF($P$25=\"-\",\"-\",($F$23*$P$25)/1000)","v":"-"}]
[null,null,null,null,null,null,null,null,{"$f":"IF('ASSESS & COMPARE'!E39=\"\",\"-\",'ASSESS & COMPARE'!E39)","v":"PKE"},null,null,{"$f":"IF('ASSESS & COMPARE'!G39=\"\",\"-\",'ASSESS & COMPARE'!G39)","v":"-"},null,{"$f":"IF('ASSESS & COMPARE'!J39=\"\",\"-\",'ASSESS & COMPARE'!J39)","v":"-"},{"$f":"IF($N$26=\"-\",\"-\",($F$23*$N$26)/1000)","v":"-"},{"$f":"IF('ASSESS & COMPARE'!L40=\"\",\"-\",'ASSESS & COMPARE'!L40)","v":"-"},{"$f":"IF($P$26=\"-\",\"-\",($F$23*$P$26)/1000)","v":"-"}]
[null,null,null,null,null,null,null,null,{"$f":"IF('ASSESS & COMPARE'!E42=\"\",\"-\",'ASSESS & COMPARE'!E42)","v":"CaCO3, %DM"},null,null,{"$f":"IF('ASSESS & COMPARE'!G42=\"\",\"-\",'ASSESS & COMPARE'!G42)","v":"-"},null,{"$f":"IF('ASSESS & COMPARE'!J42=\"\",\"-\",'ASSESS & COMPARE'!J42)","v":"-"},{"$f":"IF($N$27=\"-\",\"-\",($F$23*$N$27)/1000)","v":"-"},{"$f":"IF('ASSESS & COMPARE'!L43=\"\",\"-\",'ASSESS & COMPARE'!L43)","v":"-"},{"$f":"IF($P$27=\"-\",\"-\",($F$23*$P$27)/1000)","v":"-"}]
[null,null,"PASTURE",null,null,"CURRENT",null,null,{"$f":"IF('ASSESS & COMPARE'!E45=\"\",\"-\",'ASSESS & COMPARE'!E45)","v":"Maize grain"},null,null,{"$f":"IF('ASSESS & COMPARE'!G45=\"\",\"-\",'ASSESS & COMPARE'!G45)","v":"-"},null,{"$f":"IF('ASSESS & COMPARE'!J45=\"\",\"-\",'ASSESS & COMPARE'!J45)","v":"-"},{"$f":"IF($N$28=\"-\",\"-\",($F$23*$N$28)/1000)","v":"-"},{"$f":"IF('ASSESS & COMPARE'!L46=\"\",\"-\",'ASSESS & COMPARE'!L46)","v":"-"},{"$f":"IF($P$28=\"-\",\"-\",($F$23*$P$28)/1000)","v":"-"}]
[]
[null,null,{"$f":"IF('ASSESS & COMPARE'!C15=\"\",\"-\",'ASSESS & COMPARE'!C15)","v":"Pre-grazing cover "},null,null,{"$f":"IF('ASSESS & COMPARE'!G15=\"\",\"-\",'ASSESS & COMPARE'!G15)","v":"-"}]
[null,null,{"$f":"IF('ASSESS & COMPARE'!C16=\"\",\"-\",'ASSESS & COMPARE'!C16)","v":"Post-grazing residual "},null,null,{"$f":"IF('ASSESS & COMPARE'!G16=\"\",\"-\",'ASSESS & COMPARE'!G16)","v":"-"},null,null,null,null,null,"Offered (kg DM)",null,{"$f":"IF('ASSESS & COMPARE'!J49=\"\",\"-\",'ASSESS & COMPARE'!J49)","v":"-"},{"$f":"IF($N31=\"-\",\"-\",($F$23*$N31)/1000)","v":"-"},{"$f":"IF('ASSESS & COMPARE'!L50=\"\",\"-\",'ASSESS & COMPARE'!L50)","v":"-"},{"$f":"IF($P31=\"-\",\"-\",($F$23*$P31)/1000)","v":"-"}]
[null,null,{"$f":"IF('ASSESS & COMPARE'!C17=\"\",\"-\",'ASSESS & COMPARE'!C17)","v":"Hectares grazed/day  -this mob"},null,null,{"$f":"IF('ASSESS & COMPARE'!G17=\"\",\"-\",'ASSESS & COMPARE'!G17)","v":"-"},null,null,null,null,null,"Eaten",null,{"$f":"IF('ASSESS & COMPARE'!Y49=\"\",\"-\",'ASSESS & COMPARE'!Y49)","v":"-"},{"$f":"IF($N32=\"-\",\"-\",($F$23*$N32)/1000)","v":"-"},{"$f":"IF('ASSESS & COMPARE'!Y50=\"\",\"-\",'ASSESS & COMPARE'!Y50)","v":"-"},{"$f":"IF($P32=\"-\",\"-\",($F$23*$P32)/1000)","v":"-"}]
[]
[]
[null,"DIET CHECK",null,null,null,null,null,null,null,null,null,null,null,"COST CHECK"]
[]
[null,null,null,null,"DM","ME",null,"PROTEIN","NDF","SSS","STARCH","FAT",null,"$/Cow/d","$/Mob/d"]
[null,null,"RECOMMENDED",null,{"$f":"IF('ASSESS & COMPARE'!Z14=\"\",\"-\",'ASSESS & COMPARE'!Z14)","v":"-"},{"$f":"IF('ASSESS & COMPARE'!AB14=\"\",\"-\",'ASSESS & COMPARE'!AB14)","v":"-"},null,{"$f":"IF('ASSESS & COMPARE'!AE14=\"\",\"-\",'ASSESS & COMPARE'!AE14)","v":"-"},">35","<38","<30","<6"]
[]
[null,null,"CURRENT",null,{"$f":"IF('ASSESS & COMPARE'!Z16=\"\",\"-\",'ASSESS & COMPARE'!Z16)","v":"-"},{"$f":"IF('ASSESS & COMPARE'!AB16=\"\",\"-\",'ASSESS & COMPARE'!AB16)","v":"-"},null,{"$f":"IF('ASSESS & COMPARE'!AE16=\"\",\"-\",'ASSESS & COMPARE'!AE16)","v":"-"},{"$f":"IF('ASSESS & COMPARE'!AH16=\"\",\"-\",'ASSESS & COMPARE'!AH16)","v":"-"},{"$f":"IF('ASSESS & COMPARE'!AK16=\"\",\"-\",'ASSESS & COMPARE'!AK16)","v":"-"},{"$f":"IF('ASSESS & COMPARE'!AN16=\"\",\"-\",'ASSESS & COMPARE'!AN16)","v":"-"},{"$f":"IF('ASSESS & COMPARE'!AQ16=\"\",\"-\",'ASSESS & COMPARE'!AQ16)","v":"-"},null,{"$f":"IF('ASSESS & COMPARE'!AS16=\"\",\"-\",'ASSESS & COMPARE'!AS16)","v":"-"},{"$f":"IF('ASSESS & COMPARE'!AU16=\"\",\"-\",'ASSESS & COMPARE'!AU16)","v":"-"}]
[]
[null,null,"PROPOSED",null,{"$f":"IF('ASSESS & COMPARE'!Z18=\"\",\"-\",'ASSESS & COMPARE'!Z18)","v":"-"},{"$f":"IF('ASSESS & COMPARE'!AB18=\"\",\"-\",'ASSESS & COMPARE'!AB18)","v":"-"},null,{"$f":"IF('ASSESS & COMPARE'!AE18=\"\",\"-\",'ASSESS & COMPARE'!AE18)","v":"-"},{"$f":"IF('ASSESS & COMPARE'!AH18=\"\",\"-\",'ASSESS & COMPARE'!AH18)","v":"-"},{"$f":"IF('ASSESS & COMPARE'!AK18=\"\",\"-\",'ASSESS & COMPARE'!AK18)","v":"-"},{"$f":"IF('ASSESS & COMPARE'!AN18=\"\",\"-\",'ASSESS & COMPARE'!AN18)","v":"-"},{"$f":"IF('ASSESS & COMPARE'!AQ18=\"\",\"-\",'ASSESS & COMPARE'!AQ18)","v":"-"},null,{"$f":"IF('ASSESS & COMPARE'!AS18=\"\",\"-\",'ASSESS & COMPARE'!AS18)","v":"-"},{"$f":"IF('ASSESS & COMPARE'!AU18=\"\",\"-\",'ASSESS & COMPARE'!AU18)","v":"-"}]

{"sheet":"Not so QUICK CHECK","index":8,"n_rows":67,"n_cols":76,"rows_kept":67,"cut":false,"hidden":true,"merged":[[31,75,31,76],[33,3,33,4],[31,3,31,4],[31,63,31,64],[15,3,15,4],[29,3,29,4],[21,27,21,28],[21,57,21,58],[21,54,21,55],[21,51,21,52],[31,72,31,73],[31,69,31,70],[31,66,31,67],[20,48,20,59],[49,3,49,4],[55,19,55,54],[37,3,37,4],[39,3,39,4],[41,3,41,4],[43,3,43,4],[45,3,45,4],[47,3,47,4],[35,3,35,4],[23,3,23,4],[25,3,25,4],[27,3,27,4],[21,24,21,25],[1,30,1,31],[56,19,56,57],[57,19,57,57],[58,19,58,57],[59,19,59,57],[2,49,2,54],[21,30,21,31],[21,33,21,34],[21,36,21,37]]}
[]
[null," INPUTS",null,null,null,null,null,null,null,null,null,null,null,null,null,null,null,"CALCULATIONS",null,null,null,null,"ENERGY REQUIREMENTS",null,null,null,null,null,"OPTION 1",null,"OPTION 2",null,null,null,null,null,null,null,null,null,null,"KEY"]
[null,null,null,null,null,null,null,null,null,null,null,null,null,null,null,null,null,null,null,null,null,null,null,null,null,null,null,null,"MJME",null,null,"MJME",null,null,null,null,null,null,null,null,null,null,null,null,null,null,null,null,null,null,null,null,null,null,null,null,null,null,null,null,null,null,null,"Background calcs (these could be hidden or somewhere else)"]
[null,null,null,null,null,null,null,null,null,null,null,null,null,null,null,null,null,null,null,null,null,null,"maintenance",null,null,null,null,null,{"$f":"VLOOKUP('   ASK    '!$K$11,'Data source'!$B$190:$C$199,2,FALSE)","v":68},null,null,{"$f":"VLOOKUP('   ASK    '!$K$11,'Data source'!$B$190:$C$199,2,FALSE)","v":68},null,null,null,null,"Feed selection fron drop down list"]
[null,null,null,null,null,null,null,null,null,null,null,null,null,null,null,null,null,null,null,null,null,null,"total MS production",null,null,null,null,null,{"$f":"$G$9*$BM$11","v":{"$error":"#N/A"}},null,null,{"$f":"$K$9*$BN$11","v":{"$error":"#N/A"}},null,null,null,null,"Option 1  drop-down or enter values"]
[null,"MOB INPUTS",null,null,null,null,"OPTION 1",null,"OPTION 2",null,null,null,null,null,null,null,null,null,null,null,null,null,"daily BCS gain/loss",null,null,null,null,null,{"$f":"IF($G$11<0,$BR$8,IF($G$11>0,$BR$9,0))","v":-4.8692000000000002},null,null,{"$f":"IF($K$11<0,$BS$8,IF($K$11>0,$BS$9,0))","v":0},null,null,null,null,"Option 2  drop-down or enter values",null,null,null,null,null,null,null,null,null,null,null,null,null,null,null,null,null,null,null,null,null,null,null,null,null,null,null,"Current","Proposed",null,null,null,"Current","Proposed",null,null,"Current",null,"Proposed"]
[null,null,null,"Stage of lactation",null,null,"mid",null,"mid",null,{"$f":"IF($I7=\"-\",$G7,$I7)","v":"mid"},null,null,null,null,null,null,null,null,null,null,null,"pregnancy",null,null,null,null,null,{"$f":"BM12","v":51},null,null,{"$f":"BN12","v":51},null,null,null,null,"Calculated value",null,null,null,null,null,10,null,null,null,null,null,null,null,null,null,null,null,null,null,null,null,null,null,null,null,null,"stage of lactation",{"$f":"VLOOKUP(G7,'Data source'!$B$251:$AN$255,2,FALSE)","v":16},{"$f":"VLOOKUP(K7,'Data source'!$B$251:$AN$255,2,FALSE)","v":16},null,"change LWT/d",null,{"$f":"ABS('   ASK    '!$K$11*0.0658*$G$11)/30","v":0.13159999999999999},{"$f":"ABS('   ASK    '!$K$11*0.0658*$K$11)/30","v":0},null,"Average ME of diet (MJ ME)",{"$f":"$V$15/$S$52","v":{"$error":"#N/A"}},null,{"$f":"$W$17/S53","v":{"$error":"#N/A"}}]
[null,null,null,"Cows in mob",null,null,130,null,150,null,{"$f":"IF(I8>0,I8,G8)","v":150},null,null,null,null,null,null,null,null,null,null,null,"total activity",null,null,null,null,null,{"$f":"$BM$13*'   ASK    '!#REF!","v":{"$error":"#REF!"}},null,null,{"$f":"$BN$13*'   ASK    '!#REF!","v":{"$error":"#REF!"}},null,null,null,null,"Out of recommended range",null,null,null,null,null,null,null,null,null,null,null,null,null,null,null,null,null,null,null,null,null,null,null,null,null,null,"breed",{"$f":" IF('   ASK    '!$K$8=\"Jersey\",\"j\",IF('   ASK    '!$K$8=\"Friesian\",\"f\",IF('   ASK    '!$K$8=\"cross-bred\",\"x\",\"-\")))","v":"f"},{"$f":" IF('   ASK    '!$K$8=\"Jersey\",\"j\",IF('   ASK    '!$K$8=\"Friesian\",\"f\",IF('   ASK    '!$K$8=\"cross-bred\",\"x\",\"-\")))","v":"f"},null,"ME loss/d",null,{"$f":" IF($G$7=\"dry\",$BR$7*-30,$BR$7*-37)","v":-4.8692000000000002},{"$f":" IF($K$7=\"dry\",$BS$7*-30,$BS$7*-37)","v":0},null,"Total DMI requirements (kg DM)",{"$f":"$AC$9/$BV$7","v":{"$error":"#N/A"}},null,{"$f":"AF9/$BX$7","v":{"$error":"#N/A"}}]
[null,null,null,"Milk solids (kg MS/cow/day)",null,null,1.2,null,1.1000000000000001,null,{"$f":"IF(I9>0,I9,G9)","v":1.1000000000000001},null,null,null,null,null,null,null,null,null,null,null,"Total ME requirements",null,null,null,null,null,{"$f":"SUM(AC4:AC8)","v":{"$error":"#N/A"}},null,null,{"$f":"SUM(AF4:AF8)","v":{"$error":"#N/A"}},null,null,null,null,null,null,null,null,null,null,null,null,null,null,null,null,null,null,null,null,null,null,null,null,null,null,null,null,null,null,null,"energy density of diet",{"$f":"IF($BV$7<10.5,1,IF(AND($BV$7>10.5,$BV$7<11.5),2,IF($BV$7>11.5,3,FALSE)))","v":{"$error":"#N/A"}},{"$f":"IF($BX$7<10.5,1,IF(AND($BX$7>10.5,$BX$7<11.5),2,IF($BX$7>11.5,3,FALSE)))","v":{"$error":"#N/A"}},null,"ME gain/d",null,{"$f":"IF($G$7=\"dry\",$BR$7*72,$BR$7*50)","v":6.58},{"$f":"IF($K$7=\"dry\",$BS$7*72,$BS$7*50)","v":0},null,"Difference in ME  intake (MJ)",{"$f":"V15-$AC$9","v":{"$error":"#N/A"}},null,{"$f":"$W$17-AF9","v":{"$error":"#N/A"}}]
[null,null,null,"Daily walking distance (km)",null,null,3,null,3,null,{"$f":"IF(I10>0,I10,G10)","v":3},null,null,null,null,null,null,null,null,null,null,null,null,null,null,null,null,null,null,null,null,null,null,null,null,null,null,null,null,null,null,null,null,null,null,null,null,null,null,null,null,null,null,null,null,null,null,null,null,null,null,null,null,"wk precalving",{"$f":"IF('   ASK    '!$S$34>12,\"12+\",'   ASK    '!$S$34)","v":-283.42857142857144},{"$f":"IF('   ASK    '!$S$34>12,\"12+\",'   ASK    '!$S$34)","v":-283.42857142857144},null,"DM difference",null,{"$f":"BV10","v":{"$error":"#N/A"}},{"$f":"BX10","v":{"$error":"#N/A"}},null,"Difference in DMI (kg DM)",{"$f":"$BV$9/$BV$7","v":{"$error":"#N/A"}},null,{"$f":"$BX$9/$BX$7","v":{"$error":"#N/A"}}]
[null,null,null,"Monthly BCS loss/gain",null,null,-0.1,null,0,null,{"$f":"IF($I11=\"-\",$G11,$I11)","v":0},null,null,null,null,"DIET CHECK",null,null,null,null,null,null,null,null,null,null,null,null,null,null,null,null,null,null,null,null,null,null,null,null,"COST CHECK",null,null,null,null,null,null,null,null,null,null,null,null,null,null,null,null,null,null,null,null,null,null,"milk production",{"$f":"IF(AND($BM$9=1,$BM$8=\"j\"),76,IF(AND($BM$9=2,$BM$8=\"j\"),73,IF(AND($BM$9=3,$BM$8=\"j\"),70,IF(AND($BM$9=1,$BM$8=\"x\"),79,IF(AND($BM$9=2,$BM$8=\"x\"),75,IF(AND($BM$9=3,$BM$8=\"x\"),73,IF(AND($BM$9=1,$BM$8=\"f\"),81,IF(AND($BM$9=2,$BM$8=\"f\"),77,IF(AND($BM$9=3,$BM$8=\"f\"),75,FALSE)))))))))","v":{"$error":"#N/A"}},{"$f":"IF(AND($BN$9=1,$BN$8=\"j\"),76,IF(AND($BN$9=2,$BN$8=\"j\"),73,IF(AND($BN$9=3,$BN$8=\"j\"),70,IF(AND($BN$9=1,$BN$8=\"x\"),79,IF(AND($BN$9=2,$BN$8=\"x\"),75,IF(AND($BN$9=3,$BN$8=\"x\"),73,IF(AND($BN$9=1,$BN$8=\"f\"),81,IF(AND($BN$9=2,$BN$8=\"f\"),77,IF(AND($BN$9=3,$BN$8=\"f\"),75,FALSE)))))))))","v":{"$error":"#N/A"}},null,"Bypass",null,0.35,0.35]
[null,null,null,null,null,null,null,null,null,null,null,null,null,null,null,null,null,null,null,"DM","@MJME","ME Curr.","ME Prop.",null,null,"PROTEIN",null,null,"NDF",null,null,"SSS",null,null,"STARCH",null,null,"FAT",null,null,null,"$/Cow per day",null,"$/Mob per day",null,null,null,null,null,null,null,null,null,null,null,null,null,null,null,null,null,null,null,"pregnancy",{"$f":"IF($BM$10=\"12+\",0,IF(AND($BM$10<=2,$BM$8=\"j\"),40,IF(AND($BM$10<=4,$BM$8=\"j\"),30,IF(AND($BM$10<=8,$BM$8=\"j\"),17,IF(AND($BM$10<=12,$BM$8=\"j\"),10,IF(AND($BM$10<=2,$BM$8=\"x\"),45,IF(AND($BM$10<=4,$BM$8=\"x\"),35,IF(AND($BM$10<=8,$BM$8=\"x\"),20,IF(AND($BM$10<=12,$BM$8=\"x\"),11,IF(AND($BM$10<=2,$BM$8=\"f\"),51,IF(AND($BM$10<=4,$BM$8=\"f\"),39,IF(AND($BM$10<=8,$BM$8=\"f\"),22,IF(AND($BM$10<=12,$BM$8=\"f\"),12,)))))))))))))","v":51},{"$f":"IF($BN$10=\"12+\",0,IF(AND($BN$10<=2,$BN$8=\"j\"),40,IF(AND($BN$10<=4,$BN$8=\"j\"),30,IF(AND($BN$10<=8,$BN$8=\"j\"),17,IF(AND($BN$10<=12,$BN$8=\"j\"),10,IF(AND($BN$10<=2,$BN$8=\"x\"),45,IF(AND($BN$10<=4,$BN$8=\"x\"),35,IF(AND($BN$10<=8,$BN$8=\"x\"),20,IF(AND($BN$10=12,$BN$8=\"x\"),11,IF(AND($BN$10<2.01,$BN$8=\"f\"),51,IF(AND($BN$10<=4,$BN$8=\"f\"),39,IF(AND($BN$10<=8,$BN$8=\"f\"),22,IF(AND($BN$10<=12,$BN$8=\"f\"),12,)))))))))))))","v":51},null,"Soluble",null,0.32,0.32]
[null,null,null,null,null,null,null,null,null,null,null,null,null,null,null,null,"RECOMMENDED",null,null,{"$f":"BV8","v":{"$error":"#N/A"}},{"$f":"BV$7","v":{"$error":"#N/A"}},{"$f":"$AC$9","v":{"$error":"#N/A"}},{"$f":"$AF$9","v":{"$error":"#N/A"}},null,null,{"$f":"BM7","v":16},null,null,">35",null,null,"<38",null,null,"<30",null,null,"<6",null,null,null,null,null,null,null,null,null,null,null,null,null,null,null,null,null,null,null,null,null,null,null,null,null,"per kg walked",{"$f":"VLOOKUP('   ASK    '!$E$11,'Data source'!$B$209:$C$212,2,FALSE)","v":2},{"$f":"VLOOKUP('   ASK    '!$E$11,'Data source'!$B$209:$C$212,2,FALSE)","v":2},null,"Degradable",null,0.65,0.65]
[null,"PASTURE QUALITY"]
[null,null,null,null,null,null,"MJME",null," adjust MJME?",null,null,null,null,null,null,null,"OPTION 1",null,null,{"$f":"S52","v":{"$error":"#N/A"}},{"$f":"BV$7","v":{"$error":"#N/A"}},{"$f":"V52","v":{"$error":"#N/A"}},null,null,null,{"$f":"Z52","v":{"$error":"#N/A"}},null,null,{"$f":"AC52","v":{"$error":"#N/A"}},null,null,{"$f":"AF52","v":{"$error":"#N/A"}},null,null,{"$f":"AI52","v":{"$error":"#N/A"}},null,null,{"$f":"AL52","v":{"$error":"#N/A"}},null,null,null,{"$f":"AT52","v":{"$error":"#N/A"}},null,{"$f":"AQ52","v":{"$error":"#N/A"}}]
[null,null,null,"Pasture summer stalky",null,null,{"$f":"IF(D16=\"-\",\"\",VLOOKUP(D16,'Data source'!$B$15:$I$99,3,FALSE))","v":{"$error":"#N/A"}},null,9.5,null,{"$f":"IF(I16>0,I16,G16)","v":9.5},"=",null,null,null,null,null,null,"diff",{"$f":"T15-T13","v":{"$error":"#N/A"}},null,{"$f":"V15-V13","v":{"$error":"#N/A"}}]
[null,null,null,null,null,null,null,null,null,null,{"$f":"IF(I17>0,I17,G17)","v":0},null,null,null,null,null,"OPTION 2",null,null,{"$f":"S53","v":{"$error":"#N/A"}},{"$f":"BX7","v":{"$error":"#N/A"}},null,{"$f":"V53","v":{"$error":"#N/A"}},null,null,{"$f":"Z53","v":{"$error":"#N/A"}},null,null,{"$f":"AC53","v":{"$error":"#N/A"}},null,null,{"$f":"AF53","v":{"$error":"#N/A"}},null,null,{"$f":"AI53","v":{"$error":"#N/A"}},null,null,{"$f":"AL53","v":{"$error":"#N/A"}},null,null,null,{"$f":"AT53","v":{"$error":"#N/A"}},null,{"$f":"AQ53","v":{"$error":"#N/A"}}]
[null,null,null,null,null,null,null,null,null,null,null,null,null,null,null,null,null,null,"diff",{"$f":"T17-T13","v":{"$error":"#N/A"}},null,null,{"$f":"W17-W13","v":{"$error":"#N/A"}}]
[]
[]
[null,"ENERGY SUPPLY",null,null,null,null,null,null,null,null,null,null,null,null,null,null,null,null,null,"ENERGY",null,null,null,null,null,null,null,null,null,null,"COMPOSITION",null,null,null,null,null,null,null,null,null,null,null,null,"COST OF FEED",null,null,null,null,"CRUDE PROTEIN BREAKDOWN"]
[null,null,null,null,null,null,"OPTION 1",null,"OPTION 2",null,null,null,null,null,null,null,null,null,null,null,null,"ME",null,null,"Crude protein",null,null,"NDF",null,null,"SSS",null,null,"Starch",null,null,"Fat",null,null,null,null,"Feed","Wt","Eaten","Eaten","Cost",null,null,null,"% of",null,"undegradable",null,null,"soluable",null,null,"degradable"]
[null,"FEED",null,"FEEDING METHOD",null,null,"KgDM",null,"KgDM",null,null,null,null,null,null,null,null,"Util.","Eaten","ME","DM%","in diet",null,null,"% DM","% diet",null,"% DM","% diet",null,"% DM","% diet",null,"% S","% diet",null,"% DM","% diet",null,null,null,"$/t","Wet/Dry","c/kg DM","c/MJ ME","$/Cow",null,null,null,"diet",null,"%","Total %",null,"%","Total %",null,"%","Total %"]
[null,{"$f":"D16","v":"Pasture summer stalky"},null,"grazing - good conditions",null,null,8,null,null,null,null,{"$f":"IF(OR($D$16=\"-\",$D24=\"-\",$G24=0),0,G24)","v":8},null,null,null,null,null,{"$f":"IF(OR($D16=\"-\",$D24=\"-\",$G24=0),\"\",VLOOKUP($D24,'Data source'!$B$122:$C$125,2,FALSE))","v":0.9},{"$f":"IF(OR(D16=\"-\",$D24=\"-\",$G24=0),\"\",G24*R24)","v":7.2},{"$f":"K16","v":9.5},{"$f":"IF(OR($D16=\"-\",$D24=\"-\",$G24=0),\"\",VLOOKUP($D16,'Data source'!$B$15:$I$99,2,FALSE))","v":{"$error":"#N/A"}},{"$f":"IF(OR($D16=\"-\",$D24=\"-\",$G24=0),\"\",S24*T24)","v":68.400000000000006},null,null,{"$f":"IF(OR($D16=\"-\",$D24=\"-\",$G24=0),\"\",VLOOKUP($D16,'Data source'!$B$15:$I$99,4,FALSE))","v":{"$error":"#N/A"}},{"$f":"IF(OR($D16=\"-\",$D24=\"-\",$G24=0),\"\",(($S24/$S$52)*Y24))","v":{"$error":"#N/A"}},null,{"$f":"IF(OR($D16=\"-\",$D24=\"-\",$G24=0),\"\",VLOOKUP($D16,'Data source'!$B$15:$I$99,5,FALSE))","v":{"$error":"#N/A"}},{"$f":"IF(OR($D16=\"-\",$D24=\"-\",$G24=0),\"\",(($S24/$S$52)*AB24))","v":{"$error":"#N/A"}},null,{"$f":"IF(OR($D16=\"-\",$D24=\"-\",$G24=0),\"\",VLOOKUP($D16,'Data source'!$B$15:$I$99,6,FALSE))","v":{"$error":"#N/A"}},{"$f":"IF(OR($D16=\"-\",$D24=\"-\",$G24=0),\"\",(($S24/$S$52)*AE24))","v":{"$error":"#N/A"}},null,{"$f":"IF(OR($D16=\"-\",$D24=\"-\",$G24=0),\"\",VLOOKUP($D16,'Data source'!$B$15:$I$99,7,FALSE))","v":{"$error":"#N/A"}},{"$f":"IF(OR($D16=\"-\",$D24=\"-\",$G24=0),\"\",(($S24/$S$52)*AH24))","v":{"$error":"#N/A"}},null,{"$f":"IF(OR($D16=\"-\",$D24=\"-\",$G24=0),\"\",VLOOKUP($D16,'Data source'!$B$15:$I$99,8,FALSE))","v":{"$error":"#N/A"}},{"$f":"IF(OR($D16=\"-\",$D24=\"-\",$G24=0),\"\",(($S24/$S$52)*AK24))","v":{"$error":"#N/A"}},null,null,null,70,{"$f":"IF(OR($D16=\"-\",$D24=\"-\",$G24=0),\"\",VLOOKUP($D16,'Data source'!$B$15:$M$99,12,FALSE))","v":{"$error":"#N/A"}},{"$f":"IF(OR($D16=\"-\",$D24=\"-\",$G24=0),\"\",IF($AQ24=\"Dry\",$AP24/$R24/10,IF($AQ24=\"Wet\",$AP24/($U24/100)*$R24/10,0)))","v":{"$error":"#N/A"}},{"$f":"IF(OR($D16=\"-\",$D24=\"-\",$G24=0),\"\",AR24/T24)","v":{"$error":"#N/A"}},{"$f":"IF(OR($D16=\"-\",$D24=\"-\",$G24=0),\"\",($AR24*$G24)/100)","v":{"$error":"#N/A"}},null,null,null,{"$f":"Z24","v":{"$error":"#N/A"}},null,{"$f":"IF(OR($D$16=\"-\",$D24=\"-\",$G24=0),\"\",VLOOKUP($D$16,'Data source'!$B$15:$M99,9,FALSE))","v":{"$error":"#N/A"}},{"$f":"IF(OR($AX24=\"\",$AZ24=\"\"),\"\",$AX24*$AZ24)","v":{"$error":"#N/A"}},null,{"$f":"IF(OR($D16=\"-\",$D24=\"-\",$G24=0),\"\",VLOOKUP($D16,'Data source'!$B$15:$M$99,10,FALSE))","v":{"$error":"#N/A"}},{"$f":"IF(OR($AX24=\"\",$BC24=\"\"),\"\",$AX24*$BC24)","v":{"$error":"#N/A"}},null,{"$f":"IF(OR($D16=\"-\",$D24=\"-\",$G24=0),\"\",VLOOKUP($D16,'Data source'!$B$15:$M$99,11,FALSE))","v":{"$error":"#N/A"}},{"$f":"IF(OR($AX24=\"\",$BF24=\"\"),\"\",$AX24*$BF24)","v":{"$error":"#N/A"}}]
[]
[null,null,null,"-",null,null,null,null,13,null,{"$f":"IF(D26=\"-\",D24,D26)","v":"grazing - good conditions"},{"$f":"IF(OR($D$16=\"-\",D24=\"-\",$I26=0),0,I26)","v":13},null,null,null,null,null,{"$f":"IF(OR(D16=\"-\",$K26=\"-\",$I26=0),\"\",VLOOKUP($K26,'Data source'!$B$122:$C$125,2,FALSE))","v":0.9},{"$f":"IF(OR($D16=\"-\",K26=\"-\",$I26=0),\"\",$I26*$R26)","v":11.700000000000001},{"$f":"K16","v":9.5},{"$f":"IF(OR(D16=\"-\",$K26=\"-\",$I26=\"\"),\"\",VLOOKUP(D16,'Data source'!$B$15:$I$99,2,FALSE))","v":{"$error":"#N/A"}},{"$f":"IF(OR(D16=\"-\",$K26=\"-\",$I26=\"\"),\"\",$S26*$T26)","v":111.15},null,null,{"$f":"IF(OR($D16=\"-\",$K26=\"-\",$I26=\"\"),\"\",VLOOKUP($D16,'Data source'!$B$15:$I$99,4,FALSE))","v":{"$error":"#N/A"}},{"$f":"IF(OR($D16=\"-\",$K26=\"-\",$I26=\"\"),\"\",(($S26/$S$53)*$Y26))","v":{"$error":"#N/A"}},null,{"$f":"IF(OR($D16=\"-\",$K26=\"-\",$I26=0),\"\",VLOOKUP($D16,'Data source'!$B$15:$I$99,5,FALSE))","v":{"$error":"#N/A"}},{"$f":"IF(OR($D16=\"-\",$K26=\"-\",$I26=0),\"\",(($S26/$S$53)*AB26))","v":{"$error":"#N/A"}},null,{"$f":"IF(OR($D16=\"-\",$K26=\"-\",$I26=0),\"\",VLOOKUP($D16,'Data source'!$B$15:$I$99,6,FALSE))","v":{"$error":"#N/A"}},{"$f":"IF(OR($D16=\"-\",$K26=\"-\",$I26=0),\"\",(($S26/$S$53)*AE26))","v":{"$error":"#N/A"}},null,{"$f":"IF(OR($D16=\"-\",$K26=\"-\",$I26=0),\"\",VLOOKUP($D16,'Data source'!$B$15:$I$99,7,FALSE))","v":{"$error":"#N/A"}},{"$f":"IF(OR($D16=\"-\",$K26=\"-\",$I26=0),\"\",(($S26/$S$53)*AH26))","v":{"$error":"#N/A"}},null,{"$f":"IF(OR($D16=\"-\",$K26=\"-\",$I26=0),\"\",VLOOKUP($D16,'Data source'!$B$15:$I$99,8,FALSE))","v":{"$error":"#N/A"}},{"$f":"IF(OR($D16=\"-\",$K26=\"-\",$I26=0),\"\",(($S26/$S$53)*AK26))","v":{"$error":"#N/A"}},null,null,null,null,{"$f":"IF(OR($D16=\"-\",$K26=\"-\",$I26=0),\"\",VLOOKUP($D16,'Data source'!$B$15:$M$99,12,FALSE))","v":{"$error":"#N/A"}},{"$f":"IF(OR($D16=\"-\",$K26=\"-\",$I26=0),\"\",IF($AQ26=\"Dry\",$AP24/$R26/10,IF($AQ26=\"Wet\",$AP24/($U26/100)*$R26/10,0)))","v":{"$error":"#N/A"}},{"$f":"IF(OR($D16=\"-\",$K26=\"-\",$I26=0),\"\",AR26/T26)","v":{"$error":"#N/A"}},{"$f":"IF(OR($D16=\"-\",$K26=\"-\",$I26=0),\"\",($AR26*$I26)/100)","v":{"$error":"#N/A"}},null,null,null,{"$f":"Z26","v":{"$error":"#N/A"}},null,{"$f":"IF(OR($D$16=\"-\",$K26=\"-\",$I26=0),\"\",VLOOKUP($D$16,'Data source'!$B$15:$M188,9,FALSE))","v":{"$error":"#N/A"}},{"$f":"IF(OR(AX26=\"\",AZ26=\"\"),\"\",AX26*AZ26)","v":{"$error":"#N/A"}},null,{"$f":"IF(OR($D$16=\"-\",$K26=\"-\",$I26=0),\"\",VLOOKUP($D$16,'Data source'!$B$15:$M188,10,FALSE))","v":{"$error":"#N/A"}},{"$f":"IF(OR($AX26=\"\",$BC26=\"\"),\"\",$AX26*$BC26)","v":{"$error":"#N/A"}},null,{"$f":"IF(OR($D$16=\"-\",$K26=\"-\",$I26=0),\"\",VLOOKUP($D$16,'Data source'!$B$15:$M188,11,FALSE))","v":{"$error":"#N/A"}},{"$f":"IF(OR($AX26=\"\",$BF26=\"\"),\"\",$AX26*$BF26)","v":{"$error":"#N/A"}}]
[null,null,null,null,null,null,null,null,null,null,null,null,null,null,null,null,null,null,null,null,null,null,null,null,null,null,null,null,null,null,null,null,null,null,null,null,null,null,null,null,null,null,null,null,null,null,null,null,null,null,null,null,null,null,null,{"$f":"IF(OR($AX27=\"\",$BC27=\"\"),\"\",$AX27*$BC27)","v":""},null,null,{"$f":"IF(OR($AX27=\"\",$BF27=\"\"),\"\",$AX27*$BF27)","v":""}]
["Feed 1","silage lucerne",null,"grazing - good conditions",null,null,2,null,null,null,null,{"$f":"IF(OR($D$16=\"-\",$D28=\"-\",$G28=0),0,G28)","v":2},null,null,null,null,null,{"$f":"IF(OR($B28=\"-\",K30=\"-\",$G28=\"-\"),\"\",VLOOKUP(D28,'Data source'!$B$127:$C$137,2,FALSE))","v":{"$error":"#N/A"}},{"$f":"IF(OR($B$28=\"-\",D28=\"-\",$G$28=\"-\"),\"\",$G$28*$R$28)","v":{"$error":"#N/A"}},{"$f":"IF(OR($B$28=\"-\",D28=\"-\",$G$28=\"-\"),\"\",VLOOKUP($B$28,'Data source'!$B$15:$I$99,3,FALSE))","v":{"$error":"#N/A"}},{"$f":"IF(OR($B$28=\"-\",D28=\"-\",$G$28=\"-\"),\"\",VLOOKUP($B$28,'Data source'!$B$15:$I$99,2,FALSE))","v":{"$error":"#N/A"}},{"$f":"IF(OR($B$28=\"-\",D28=\"-\",$G$28=\"-\"),\"\",$S$28*$T$28)","v":{"$error":"#N/A"}},null,null,{"$f":"IF(OR($B$28=\"-\",D28=\"-\",$G$28=\"-\"),\"\",VLOOKUP($B$28,'Data source'!$B$15:$I$99,4,FALSE))","v":{"$error":"#N/A"}},{"$f":"IF(OR($B$28=\"-\",D28=\"-\",$G$28=\"-\"),\"\",(($S$28/$S$52)*$Y$28))","v":{"$error":"#N/A"}},null,{"$f":"IF(OR($B28=\"-\",D28=\"-\",$G28=\"-\"),\"\",VLOOKUP($B28,'Data source'!$B$15:$I$99,5,FALSE))","v":{"$error":"#N/A"}},{"$f":"IF(OR($B28=\"-\",D28=\"-\",$G28=\"-\"),\"\",(($S28/$S$52)*AB28))","v":{"$error":"#N/A"}},null,{"$f":"IF(OR($B28=\"-\",D28=\"-\",$G28=\"-\"),\"\",VLOOKUP($B28,'Data source'!$B$15:$I$99,6,FALSE))","v":{"$error":"#N/A"}},{"$f":"IF(OR($B28=\"-\",D28=\"-\",$G28=\"-\"),\"\",(($S28/$S$52)*AE28))","v":{"$error":"#N/A"}},null,{"$f":"IF(OR($B28=\"-\",D28=\"-\",$G28=\"-\"),\"\",VLOOKUP($B28,'Data source'!$B$15:$I$99,7,FALSE))","v":{"$error":"#N/A"}},{"$f":"IF(OR($B28=\"-\",D28=\"-\",$G28=\"-\"),\"\",(($S28/$S$52)*AH28))","v":{"$error":"#N/A"}},null,{"$f":"IF(OR($B28=\"-\",D28=\"-\",$G28=\"-\"),\"\",VLOOKUP($B28,'Data source'!$B$15:$I$99,8,FALSE))","v":{"$error":"#N/A"}},{"$f":"IF(OR($B28=\"-\",D16=\"-\",$G28=\"-\"),\"\",(($S28/$S$52)*AK28))","v":{"$error":"#N/A"}},null,null,null,150,{"$f":"IF(OR($B28=\"-\",D28=\"-\",$G28=\"-\"),\"\",VLOOKUP($B28,'Data source'!$B$15:$M$99,12,FALSE))","v":{"$error":"#N/A"}},{"$f":"IF(OR($B28=\"-\",D28=\"-\",$G28=\"-\"),\"\",IF($AQ28=\"Dry\",$AP28/$R28/10,IF($AQ28=\"Wet\",$AP28/($U28/100)*$R28/10,0)))","v":{"$error":"#N/A"}},{"$f":"IF(OR($B28=\"-\",D28=\"-\",$G28=\"-\"),\"\",AR28/T28)","v":{"$error":"#N/A"}},{"$f":"IF(OR($B28=\"-\",D28=\"-\",$G28=\"-\"),\"\",($AR28*$G28)/100)","v":{"$error":"#N/A"}},null,null,null,{"$f":"Z28","v":{"$error":"#N/A"}},null,{"$f":"IF(OR($B28=\"-\",$D28=\"-\",$G28=0),\"\",VLOOKUP($B28,'Data source'!$B$15:$M$99,9,FALSE))","v":{"$error":"#N/A"}},{"$error":"#N/A"},null,{"$f":"IF(OR($B28=\"-\",$D28=\"-\",$G28=0),\"\",VLOOKUP($B28,'Data source'!$B$15:$M$99,10,FALSE))","v":{"$error":"#N/A"}},{"$f":"IF(OR($AX28=\"\",$BC28=\"\"),\"\",$AX28*$BC28)","v":{"$error":"#N/A"}},null,{"$f":"IF(OR($B28=\"-\",$D28=\"-\",$G28=0),\"\",VLOOKUP($B28,'Data source'!$B$15:$M$99,11,FALSE))","v":{"$error":"#N/A"}},{"$f":"IF(OR($AX28=\"\",$BF28=\"\"),\"\",$AX28*$BF28)","v":{"$error":"#N/A"}}]
[]
[null,null,null,"-",null,null,null,null,5,null,{"$f":"IF(D28=\"-\",#REF!,D28)","v":"grazing - good conditions"},{"$f":"IF(OR($D$16=\"-\",D28=\"-\",$I30=0),0,I30)","v":5},null,null,null,null,null,{"$f":"IF(OR($B28=\"-\",$K30=\"-\",$I30<=0),\"\",VLOOKUP($K30,'Data source'!$B$127:$C$137,2,FALSE))","v":{"$error":"#N/A"}},{"$f":"IF(OR($B28=\"-\",$K30=\"-\",$I30<=0),\"\",$I30*$R30)","v":{"$error":"#N/A"}},{"$f":"IF(OR($B28=\"-\",$K30=\"-\",$I30<=0),\"\",VLOOKUP($B28,'Data source'!$B$15:$I$99,3,FALSE))","v":{"$error":"#N/A"}},{"$f":"IF(OR($B28=\"-\",$K30=\"-\",$I30<=0),\"\",VLOOKUP($B28,'Data source'!$B$15:$I$99,2,FALSE))","v":{"$error":"#N/A"}},{"$f":"IF(OR($B28=\"-\",$K30=\"-\",$I30<=0),\"\",$S30*$T30)","v":{"$error":"#N/A"}},null,null,{"$f":"IF(OR($B28=\"-\",$K30=\"-\",$I30<=0),\"\",VLOOKUP($B28,'Data source'!$B$15:$I$99,4,FALSE))","v":{"$error":"#N/A"}},{"$f":"IF(OR($B28=\"-\",$K30=\"-\",$I30<=0),\"\",(($S30/$S$53)*$Y30))","v":{"$error":"#N/A"}},null,{"$f":"IF(OR($B28=\"-\",$K30=\"-\",$I30<=0),\"\",VLOOKUP($B28,'Data source'!$B$15:$I$99,5,FALSE))","v":{"$error":"#N/A"}},{"$f":"IF(OR($B28=\"-\",$K30=\"-\",$I30<=0),\"\",(($S30/$S$53)*AB30))","v":{"$error":"#N/A"}},null,{"$f":"IF(OR($B28=\"-\",$K30=\"-\",$I30<=0),\"\",VLOOKUP($B28,'Data source'!$B$15:$I$99,6,FALSE))","v":{"$error":"#N/A"}},{"$f":"IF(OR($B28=\"-\",$K30=\"-\",$I30<=0),\"\",(($S30/$S$53)*AE30))","v":{"$error":"#N/A"}},null,{"$f":"IF(OR($B28=\"-\",$K30=\"-\",$I30<=0),\"\",VLOOKUP($B28,'Data source'!$B$15:$I$99,7,FALSE))","v":{"$error":"#N/A"}},{"$f":"IF(OR($B28=\"-\",$K30=\"-\",$I30<=0),\"\",(($S30/$S$53)*AH30))","v":{"$error":"#N/A"}},null,{"$f":"IF(OR($B28=\"-\",$K30=\"-\",$I30<=0),\"\",VLOOKUP($B28,'Data source'!$B$15:$I$99,8,FALSE))","v":{"$error":"#N/A"}},{"$f":"IF(OR($B28=\"-\",$K30=\"-\",$I30<=0),\"\",(($S30/$S$53)*AK30))","v":{"$error":"#N/A"}},null,null,null,null,{"$f":"IF(OR($B28=\"-\",$K30=\"-\",$I30=0),\"\",VLOOKUP($B28,'Data source'!$B$15:$M$99,12,FALSE))","v":{"$error":"#N/A"}},{"$f":"IF(OR($B28=\"-\",$K30=\"-\",$I30=0),\"\",IF($AQ30=\"Dry\",$AP28/$R30/10,IF($AQ30=\"Wet\",$AP28/($U30/100)*$R30/10,0)))","v":{"$error":"#N/A"}},{"$f":"IF(OR($B28=\"-\",$K30=\"-\",$I30=0),\"\",AR30/T30)","v":{"$error":"#N/A"}},{"$f":"IF(OR($B28=\"-\",$K30=\"-\",$I30=0),\"\",($AR30*$I30)/100)","v":{"$error":"#N/A"}},null,null,null,{"$f":"Z30","v":{"$error":"#N/A"}},null,{"$f":"IF(OR($B28=\"-\",$K30=\"-\",$I30=0),\"\",VLOOKUP($B28,'Data source'!$B$15:$M$99,9,FALSE))","v":{"$error":"#N/A"}},{"$error":"#N/A"},null,{"$f":"IF(OR($B28=\"-\",$K30=\"-\",$I30=0),\"\",VLOOKUP($B28,'Data source'!$B$15:$M$99,10,FALSE))","v":{"$error":"#N/A"}},{"$f":"IF(OR($AX30=\"\",$BC30=\"\"),\"\",$AX30*$BC30)","v":{"$error":"#N/A"}},null,{"$f":"IF(OR($B28=\"-\",$K30=\"-\",$I30=0),\"\",VLOOKUP($B28,'Data source'!$B$15:$M$99,11,FALSE))","v":{"$error":"#N/A"}},{"$f":"IF(OR($AX30=\"\",$BF30=\"\"),\"\",$AX30*$BF30)","v":{"$error":"#N/A"}}]
[]
["Feed  2","Apple pomace",null,"grazing - good conditions",null,null,2,null,null,null,null,{"$f":"IF(OR($D$16=\"-\",$D32=\"-\",$G32=0),0,G32)","v":2},null,null,null,null,null,{"$f":"IF(OR($B32=\"-\",$D32=\"-\",$G32=\"-\"),\"\",VLOOKUP($D32,'Data source'!$B$127:$C$137,2,FALSE))","v":{"$error":"#N/A"}},{"$f":"IF(OR($B32=\"-\",$D32=\"-\",$G32=\"-\"),\"\",G32*R32)","v":{"$error":"#N/A"}},{"$f":"IF(OR($B32=\"-\",$D32=\"-\",$G32=\"-\"),\"\",VLOOKUP($B32,'Data source'!$B$15:$I$99,3,FALSE))","v":10.4},{"$f":"IF(OR($B32=\"-\",$D32=\"-\",$G32=\"-\"),\"\",VLOOKUP($B32,'Data source'!$B$15:$I$99,2,FALSE))","v":22},{"$f":"IF(OR($B32=\"-\",$D32=\"-\",$G32=\"-\"),\"\",S32*T32)","v":{"$error":"#N/A"}},null,null,{"$f":"IF(OR($B32=\"-\",$D32=\"-\",$G32=\"-\"),\"\",VLOOKUP($B32,'Data source'!$B$15:$I$99,4,FALSE))","v":5.4},{"$f":"IF(OR($B32=\"-\",$D32=\"-\",$G32=\"-\"),\"\",(($S32/$S$52)*Y32))","v":{"$error":"#N/A"}},null,{"$f":"IF(OR($B32=\"-\",$D32=\"-\",$G32=\"-\"),\"\",VLOOKUP($B32,'Data source'!$B$15:$I$99,5,FALSE))","v":41},{"$f":"IF(OR($B32=\"-\",$D32=\"-\",$G32=\"-\"),\"\",(($S32/$S$52)*AB32))","v":{"$error":"#N/A"}},null,{"$f":"IF(OR($B32=\"-\",$D32=\"-\",$G32=\"-\"),\"\",VLOOKUP($B32,'Data source'!$B$15:$I$99,6,FALSE))","v":44},{"$f":"IF(OR($B32=\"-\",$D32=\"-\",$G32=\"-\"),\"\",(($S32/$S$52)*AE32))","v":{"$error":"#N/A"}},null,{"$f":"IF(OR($B32=\"-\",$D32=\"-\",$G32=\"-\"),\"\",VLOOKUP($B32,'Data source'!$B$15:$I$99,7,FALSE))","v":100},{"$f":"IF(OR($B32=\"-\",$D32=\"-\",$G32=\"-\"),\"\",(($S32/$S$52)*AH32))","v":{"$error":"#N/A"}},null,{"$f":"IF(OR($B32=\"-\",$D32=\"-\",$G32=\"-\"),\"\",VLOOKUP($B32,'Data source'!$B$15:$I$99,8,FALSE))","v":4.7},{"$f":"IF(OR($B32=\"-\",$D32=\"-\",$G32=\"-\"),\"\",(($S32/$S$52)*AK32))","v":{"$error":"#N/A"}},null,null,null,125,{"$f":"IF(OR($B32=\"-\",$D32=\"-\",$G32=\"-\"),\"\",VLOOKUP($B32,'Data source'!$B$15:$M$99,12,FALSE))","v":"Wet"},{"$f":"IF(OR($B32=\"-\",$D32=\"-\",$G32=\"-\"),\"\",IF($AQ32=\"Dry\",$AP32/$R32/10,IF($AQ32=\"Wet\",$AP32/($U32/100)*$R32/10,0)))","v":{"$error":"#N/A"}},{"$f":"IF(OR($B32=\"-\",$D32=\"-\",$G32=\"-\"),\"\",AR32/T32)","v":{"$error":"#N/A"}},{"$f":"IF(OR($B32=\"-\",$D32=\"-\",$G32=\"-\"),\"\",($AR32*$G32)/100)","v":{"$error":"#N/A"}},null,null,null,{"$f":"Z32","v":{"$error":"#N/A"}},null,{"$f":"IF(OR($B32=\"-\",$D32=\"-\",$G32=0),\"\",VLOOKUP($B32,'Data source'!$B$15:$M$99,9,FALSE))","v":51},{"$error":"#N/A"},null,{"$f":"IF(OR($B32=\"-\",$D32=\"-\",$G32=0),\"\",VLOOKUP($B32,'Data source'!$B$15:$M$99,10,FALSE))","v":11},{"$f":"IF(OR($AX32=\"\",$BC32=\"\"),\"\",$AX32*$BC32)","v":{"$error":"#N/A"}},null,{"$f":"IF(OR($B32=\"-\",$D32=\"-\",$G32=0),\"\",VLOOKUP($B32,'Data source'!$B$15:$M$99,11,FALSE))","v":49},{"$f":"IF(OR($AX32=\"\",$BF32=\"\"),\"\",$AX32*$BF32)","v":{"$error":"#N/A"}}]
[]
[null,null,null,"-",null,null,null,null,0,null,{"$f":"IF(D34=\"-\",D32,D34)","v":"grazing - good conditions"},{"$f":"IF(OR($D$16=\"-\",D32=\"-\",$I34=0),0,I34)","v":0},null,null,null,null,null,{"$f":"IF(OR($B32=\"-\",$K34=\"-\",$I34<=0),\"\",VLOOKUP($K34,'Data source'!$B$127:$C$137,2,FALSE))","v":""},{"$f":"IF(OR($B32=\"-\",$K34=\"-\",$I34<=0),\"\",$I34*$R34)","v":""},{"$f":"IF(OR($B32=\"-\",$K34=\"-\",$I34<=0),\"\",VLOOKUP($B32,'Data source'!$B$15:$I$99,3,FALSE))","v":""},{"$f":"IF(OR($B32=\"-\",$K34=\"-\",$I34<=0),\"\",VLOOKUP($B32,'Data source'!$B$15:$I$99,2,FALSE))","v":""},{"$f":"IF(OR($B32=\"-\",$K34=\"-\",$I34<=0),\"\",$S34*$T34)","v":""},null,null,{"$f":"IF(OR($B32=\"-\",$K34=\"-\",$I34<=0),\"\",VLOOKUP($B32,'Data source'!$B$15:$I$99,4,FALSE))","v":""},{"$f":"IF(OR($B32=\"-\",$K34=\"-\",$I34<=0),\"\",(($S34/$S$53)*$Y34))","v":""},null,{"$f":"IF(OR($B32=\"-\",$K34=\"-\",$I34<=0),\"\",VLOOKUP($B32,'Data source'!$B$15:$I$99,5,FALSE))","v":""},{"$f":"IF(OR($B32=\"-\",$K34=\"-\",$I34<=0),\"\",(($S34/$S$53)*AB34))","v":""},null,{"$f":"IF(OR($B32=\"-\",$K34=\"-\",$I34<=0),\"\",VLOOKUP($B32,'Data source'!$B$15:$I$99,6,FALSE))","v":""},{"$f":"IF(OR($B32=\"-\",$K34=\"-\",$I34<=0),\"\",(($S34/$S$53)*AE34))","v":""},null,{"$f":"IF(OR($B32=\"-\",$K34=\"-\",$I34<=0),\"\",VLOOKUP($B32,'Data source'!$B$15:$I$99,7,FALSE))","v":""},{"$f":"IF(OR($B32=\"-\",$K34=\"-\",$I34<=0),\"\",(($S34/$S$53)*AH34))","v":""},null,{"$f":"IF(OR($B32=\"-\",$K34=\"-\",$I34<=0),\"\",VLOOKUP($B32,'Data source'!$B$15:$I$99,8,FALSE))","v":""},{"$f":"IF(OR($B32=\"-\",$K34=\"-\",$I34<=0),\"\",(($S34/$S$53)*AK34))","v":""},null,null,null,null,{"$f":"IF(OR($B32=\"-\",$K34=\"-\",$I34=0),\"\",VLOOKUP($B32,'Data source'!$B$15:$M$99,12,FALSE))","v":""},{"$f":"IF(OR($B32=\"-\",$K34=\"-\",$I34=0),\"\",IF($AQ34=\"Dry\",$AP32/$R34/10,IF($AQ34=\"Wet\",$AP32/($U34/100)*$R34/10,0)))","v":""},{"$f":"IF(OR($B32=\"-\",$K34=\"-\",$I34=0),\"\",AR34/T34)","v":""},{"$f":"IF(OR($B32=\"-\",$K34=\"-\",$I34=0),\"\",($AR34*$I34)/100)","v":""},null,null,null,{"$f":"Z34","v":""},null,{"$f":"IF(OR($B32=\"-\",$K34=\"-\",$I34=0),\"\",VLOOKUP($B32,'Data source'!$B$15:$M$99,9,FALSE))","v":""},"",null,{"$f":"IF(OR($B32=\"-\",$K34=\"-\",$I34=0),\"\",VLOOKUP($B32,'Data source'!$B$15:$M$99,10,FALSE))","v":""},"",null,{"$f":"IF(OR($B32=\"-\",$K34=\"-\",$I34=0),\"\",VLOOKUP($B32,'Data source'!$B$15:$M$99,11,FALSE))","v":""},""]
[null,null,null,null,null,null,null,null,null,null,null,null,null,null,null,null,null,null,null,null,null,null,null,null,null,null,null,null,null,null,null,null,null,null,null,null,null,null,null,null,null,null,null,null,null,null,null,null,null,null,null,null,null,null,null,"",null,null,""]
["Feed 3","Swedes",null,"grazing - good conditions",null,null,2,null,null,null,null,{"$f":"IF(OR($D$16=\"-\",$D36=\"-\",$G36=0),0,G36)","v":2},null,null,null,null,null,{"$f":"IF(OR($B36=\"-\",$D36=\"-\",$G36=\"-\"),\"\",VLOOKUP($D36,'Data source'!$B$127:$C$137,2,FALSE))","v":{"$error":"#N/A"}},{"$f":"IF(OR($B36=\"-\",$D36=\"-\",$G36=\"-\"),\"\",G36*R36)","v":{"$error":"#N/A"}},{"$f":"IF(OR($B36=\"-\",$D36=\"-\",$G36=\"-\"),\"\",VLOOKUP($B36,'Data source'!$B$15:$I$99,3,FALSE))","v":12},{"$f":"IF(OR($B36=\"-\",$D36=\"-\",$G36=\"-\"),\"\",VLOOKUP($B36,'Data source'!$B$15:$I$99,2,FALSE))","v":11},{"$f":"IF(OR($B36=\"-\",$D36=\"-\",$G36=\"-\"),\"\",S36*T36)","v":{"$error":"#N/A"}},null,null,{"$f":"IF(OR($B36=\"-\",$D36=\"-\",$G36=\"-\"),\"\",VLOOKUP($B36,'Data source'!$B$15:$I$99,4,FALSE))","v":16},{"$f":"IF(OR($B36=\"-\",$D36=\"-\",$G36=\"-\"),\"\",(($S36/$S$52)*Y36))","v":{"$error":"#N/A"}},null,{"$f":"IF(OR($B36=\"-\",$D36=\"-\",$G36=\"-\"),\"\",VLOOKUP($B36,'Data source'!$B$15:$I$99,5,FALSE))","v":23},{"$f":"IF(OR($B36=\"-\",$D36=\"-\",$G36=\"-\"),\"\",(($S36/$S$52)*AB36))","v":{"$error":"#N/A"}},null,{"$f":"IF(OR($B36=\"-\",$D36=\"-\",$G36=\"-\"),\"\",VLOOKUP($B36,'Data source'!$B$15:$I$99,6,FALSE))","v":47},{"$f":"IF(OR($B36=\"-\",$D36=\"-\",$G36=\"-\"),\"\",(($S36/$S$52)*AE36))","v":{"$error":"#N/A"}},null,{"$f":"IF(OR($B36=\"-\",$D36=\"-\",$G36=\"-\"),\"\",VLOOKUP($B36,'Data source'!$B$15:$I$99,7,FALSE))","v":0.1},{"$f":"IF(OR($B36=\"-\",$D36=\"-\",$G36=\"-\"),\"\",(($S36/$S$52)*AH36))","v":{"$error":"#N/A"}},null,{"$f":"IF(OR($B36=\"-\",$D36=\"-\",$G36=\"-\"),\"\",VLOOKUP($B36,'Data source'!$B$15:$I$99,8,FALSE))","v":0},{"$f":"IF(OR($B36=\"-\",$D36=\"-\",$G36=\"-\"),\"\",(($S36/$S$52)*AK36))","v":{"$error":"#N/A"}},null,null,null,280,{"$f":"IF(OR($B36=\"-\",$D36=\"-\",$G36=\"-\"),\"\",VLOOKUP($B36,'Data source'!$B$15:$M$99,12,FALSE))","v":"Dry"},{"$f":"IF(OR($B36=\"-\",$D36=\"-\",$G36=\"-\"),\"\",IF($AQ36=\"Dry\",$AP36/$R36/10,IF($AQ36=\"Wet\",$AP36/($U36/100)*$R36/10,0)))","v":{"$error":"#N/A"}},{"$f":"IF(OR($B36=\"-\",$D36=\"-\",$G36=\"-\"),\"\",AR36/T36)","v":{"$error":"#N/A"}},{"$f":"IF(OR($B36=\"-\",$D36=\"-\",$G36=\"-\"),\"\",($AR36*$G36)/100)","v":{"$error":"#N/A"}},null,null,null,{"$f":"Z36","v":{"$error":"#N/A"}},null,{"$f":"IF(OR($B36=\"-\",$D36=\"-\",$G36=0),\"\",VLOOKUP($B36,'Data source'!$B$15:$M$99,9,FALSE))","v":0},{"$error":"#N/A"},null,{"$f":"IF(OR($B36=\"-\",$D36=\"-\",$G36=0),\"\",VLOOKUP($B36,'Data source'!$B$15:$M$99,10,FALSE))","v":0},{"$error":"#N/A"},null,{"$f":"IF(OR($B36=\"-\",$D36=\"-\",$G36=0),\"\",VLOOKUP($B36,'Data source'!$B$15:$M$99,11,FALSE))","v":0},{"$error":"#N/A"}]
[]
[null,null,null,"-",null,null,null,null,0,null,{"$f":"IF(D38=\"-\",D36,D38)","v":"grazing - good conditions"},{"$f":"IF(OR($D$16=\"-\",D36=\"-\",$I38=0),0,I38)","v":0},null,null,null,null,null,{"$f":"IF(OR($B36=\"-\",$K38=\"-\",$I38<=0),\"\",VLOOKUP($K38,'Data source'!$B$127:$C$137,2,FALSE))","v":""},{"$f":"IF(OR($B36=\"-\",$K38=\"-\",$I38<=0),\"\",$I38*$R38)","v":""},{"$f":"IF(OR($B36=\"-\",$K38=\"-\",$I38<=0),\"\",VLOOKUP($B36,'Data source'!$B$15:$I$99,3,FALSE))","v":""},{"$f":"IF(OR($B36=\"-\",$K38=\"-\",$I38<=0),\"\",VLOOKUP($B36,'Data source'!$B$15:$I$99,2,FALSE))","v":""},{"$f":"IF(OR($B36=\"-\",$K38=\"-\",$I38<=0),\"\",$S38*$T38)","v":""},null,null,{"$f":"IF(OR($B36=\"-\",$K38=\"-\",$I38<=0),\"\",VLOOKUP($B36,'Data source'!$B$15:$I$99,4,FALSE))","v":""},{"$f":"IF(OR($B36=\"-\",$K38=\"-\",$I38<=0),\"\",(($S38/$S$53)*$Y38))","v":""},null,{"$f":"IF(OR($B36=\"-\",$K38=\"-\",$I38<=0),\"\",VLOOKUP($B36,'Data source'!$B$15:$I$99,5,FALSE))","v":""},{"$f":"IF(OR($B36=\"-\",$K38=\"-\",$I38<=0),\"\",(($S38/$S$53)*AB38))","v":""},null,{"$f":"IF(OR($B36=\"-\",$K38=\"-\",$I38<=0),\"\",VLOOKUP($B36,'Data source'!$B$15:$I$99,6,FALSE))","v":""},{"$f":"IF(OR($B36=\"-\",$K38=\"-\",$I38<=0),\"\",(($S38/$S$53)*AE38))","v":""},null,{"$f":"IF(OR($B36=\"-\",$K38=\"-\",$I38<=0),\"\",VLOOKUP($B36,'Data source'!$B$15:$I$99,7,FALSE))","v":""},{"$f":"IF(OR($B36=\"-\",$K38=\"-\",$I38<=0),\"\",(($S38/$S$53)*AH38))","v":""},null,{"$f":"IF(OR($B36=\"-\",$K38=\"-\",$I38<=0),\"\",VLOOKUP($B36,'Data source'!$B$15:$I$99,8,FALSE))","v":""},{"$f":"IF(OR($B36=\"-\",$K38=\"-\",$I38<=0),\"\",(($S38/$S$53)*AK38))","v":""},null,null,null,null,{"$f":"IF(OR($B36=\"-\",$K38=\"-\",$I38=0),\"\",VLOOKUP($B36,'Data source'!$B$15:$M$99,12,FALSE))","v":""},{"$f":"IF(OR($B36=\"-\",$K38=\"-\",$I38=0),\"\",IF($AQ38=\"Dry\",$AP36/$R38/10,IF($AQ38=\"Wet\",$AP36/($U38/100)*$R38/10,0)))","v":""},{"$f":"IF(OR($B36=\"-\",$K38=\"-\",$I38=0),\"\",AR38/T38)","v":""},{"$f":"IF(OR($B36=\"-\",$K38=\"-\",$I38=0),\"\",($AR38*$I38)/100)","v":""},null,null,null,{"$f":"Z38","v":""},null,{"$f":"IF(OR($B36=\"-\",$K38=\"-\",$I38=0),\"\",VLOOKUP($B36,'Data source'!$B$15:$M$99,9,FALSE))","v":""},"",null,{"$f":"IF(OR($B36=\"-\",$K38=\"-\",$I38=0),\"\",VLOOKUP($B36,'Data source'!$B$15:$M$99,10,FALSE))","v":""},"",null,{"$f":"IF(OR($B36=\"-\",$K38=\"-\",$I38=0),\"\",VLOOKUP($B36,'Data source'!$B$15:$M$99,11,FALSE))","v":""},""]
[null,null,null,null,null,null,null,null,null,null,null,null,null,null,null,null,null,null,null,null,null,null,null,null,null,null,null,null,null,null,null,null,null,null,null,null,null,null,null,null,null,null,null,null,null,null,null,null,null,null,null,null,null,null,null,"",null,null,""]
["Feed 4","Fodder beet",null,"grazing - good conditions",null,null,3,null,null,null,null,{"$f":"IF(OR($D$16=\"-\",$D40=\"-\",$G40=0),0,G40)","v":3},null,null,null,null,null,{"$f":"IF(OR($B40=\"-\",$D40=\"-\",$G40=\"-\"),\"\",VLOOKUP($D40,'Data source'!$B$127:$C$137,2,FALSE))","v":{"$error":"#N/A"}},{"$f":"IF(OR($B40=\"-\",$D40=\"-\",$G40=\"-\"),\"\",G40*R40)","v":{"$error":"#N/A"}},{"$f":"IF(OR($B40=\"-\",$D40=\"-\",$G40=\"-\"),\"\",VLOOKUP($B40,'Data source'!$B$15:$I$99,3,FALSE))","v":{"$error":"#N/A"}},{"$f":"IF(OR($B40=\"-\",$D40=\"-\",$G40=\"-\"),\"\",VLOOKUP($B40,'Data source'!$B$15:$I$99,2,FALSE))","v":{"$error":"#N/A"}},{"$f":"IF(OR($B40=\"-\",$D40=\"-\",$G40=\"-\"),\"\",S40*T40)","v":{"$error":"#N/A"}},null,null,{"$f":"IF(OR($B40=\"-\",$D40=\"-\",$G40=\"-\"),\"\",VLOOKUP($B40,'Data source'!$B$15:$I$99,4,FALSE))","v":{"$error":"#N/A"}},{"$f":"IF(OR($B40=\"-\",$D40=\"-\",$G40=\"-\"),\"\",(($S40/$S$52)*Y40))","v":{"$error":"#N/A"}},null,{"$f":"IF(OR($B40=\"-\",$D40=\"-\",$G40=\"-\"),\"\",VLOOKUP($B40,'Data source'!$B$15:$I$99,5,FALSE))","v":{"$error":"#N/A"}},{"$f":"IF(OR($B40=\"-\",$D40=\"-\",$G40=\"-\"),\"\",(($S40/$S$52)*AB40))","v":{"$error":"#N/A"}},null,{"$f":"IF(OR($B40=\"-\",$D40=\"-\",$G40=\"-\"),\"\",VLOOKUP($B40,'Data source'!$B$15:$I$99,6,FALSE))","v":{"$error":"#N/A"}},{"$f":"IF(OR($B40=\"-\",$D40=\"-\",$G40=\"-\"),\"\",(($S40/$S$52)*AE40))","v":{"$error":"#N/A"}},null,{"$f":"IF(OR($B40=\"-\",$D40=\"-\",$G40=\"-\"),\"\",VLOOKUP($B40,'Data source'!$B$15:$I$99,7,FALSE))","v":{"$error":"#N/A"}},{"$f":"IF(OR($B40=\"-\",$D40=\"-\",$G40=\"-\"),\"\",(($S40/$S$52)*AH40))","v":{"$error":"#N/A"}},null,{"$f":"IF(OR($B40=\"-\",$D40=\"-\",$G40=\"-\"),\"\",VLOOKUP($B40,'Data source'!$B$15:$I$99,8,FALSE))","v":{"$error":"#N/A"}},{"$f":"IF(OR($B40=\"-\",$D40=\"-\",$G40=\"-\"),\"\",(($S40/$S$52)*AK40))","v":{"$error":"#N/A"}},null,null,null,180,{"$f":"IF(OR($B40=\"-\",$D40=\"-\",$G40=\"-\"),\"\",VLOOKUP($B40,'Data source'!$B$15:$M$99,12,FALSE))","v":{"$error":"#N/A"}},{"$f":"IF(OR($B40=\"-\",$D40=\"-\",$G40=\"-\"),\"\",IF($AQ40=\"Dry\",$AP40/$R40/10,IF($AQ40=\"Wet\",$AP40/($U40/100)*$R40/10,0)))","v":{"$error":"#N/A"}},{"$f":"IF(OR($B40=\"-\",$D40=\"-\",$G40=\"-\"),\"\",AR40/T40)","v":{"$error":"#N/A"}},{"$f":"IF(OR($B40=\"-\",$D40=\"-\",$G40=\"-\"),\"\",($AR40*$G40)/100)","v":{"$error":"#N/A"}},null,null,null,{"$f":"Z40","v":{"$error":"#N/A"}},null,{"$f":"IF(OR($B40=\"-\",$D40=\"-\",$G40=0),\"\",VLOOKUP($B40,'Data source'!$B$15:$M$99,9,FALSE))","v":{"$error":"#N/A"}},{"$error":"#N/A"},null,{"$f":"IF(OR($B40=\"-\",$D40=\"-\",$G40=0),\"\",VLOOKUP($B40,'Data source'!$B$15:$M$99,10,FALSE))","v":{"$error":"#N/A"}},{"$error":"#N/A"},null,{"$f":"IF(OR($B40=\"-\",$D40=\"-\",$G40=0),\"\",VLOOKUP($B40,'Data source'!$B$15:$M$99,11,FALSE))","v":{"$error":"#N/A"}},{"$error":"#N/A"}]
[]
[null,null,null,"-",null,null,null,null,0,null,{"$f":"IF(D42=\"-\",D40,D42)","v":"grazing - good conditions"},{"$f":"IF(OR($D$16=\"-\",D40=\"-\",$I42=0),0,I42)","v":0},null,null,null,null,null,{"$f":"IF(OR($B40=\"-\",$K42=\"-\",$I42<=0),\"\",VLOOKUP($K42,'Data source'!$B$127:$C$137,2,FALSE))","v":""},{"$f":"IF(OR($B40=\"-\",$K42=\"-\",$I42<=0),\"\",$I42*$R42)","v":""},{"$f":"IF(OR($B40=\"-\",$K42=\"-\",$I42<=0),\"\",VLOOKUP($B40,'Data source'!$B$15:$I$99,3,FALSE))","v":""},{"$f":"IF(OR($B40=\"-\",$K42=\"-\",$I42<=0),\"\",VLOOKUP($B40,'Data source'!$B$15:$I$99,2,FALSE))","v":""},{"$f":"IF(OR($B40=\"-\",$K42=\"-\",$I42<=0),\"\",$S42*$T42)","v":""},null,null,{"$f":"IF(OR($B40=\"-\",$K42=\"-\",$I42<=0),\"\",VLOOKUP($B40,'Data source'!$B$15:$I$99,4,FALSE))","v":""},{"$f":"IF(OR($B40=\"-\",$K42=\"-\",$I42<=0),\"\",(($S42/$S$53)*$Y42))","v":""},null,{"$f":"IF(OR($B40=\"-\",$K42=\"-\",$I42<=0),\"\",VLOOKUP($B40,'Data source'!$B$15:$I$99,5,FALSE))","v":""},{"$f":"IF(OR($B40=\"-\",$K42=\"-\",$I42<=0),\"\",(($S42/$S$53)*AB42))","v":""},null,{"$f":"IF(OR($B40=\"-\",$K42=\"-\",$I42<=0),\"\",VLOOKUP($B40,'Data source'!$B$15:$I$99,6,FALSE))","v":""},{"$f":"IF(OR($B40=\"-\",$K42=\"-\",$I42<=0),\"\",(($S42/$S$53)*AE42))","v":""},null,{"$f":"IF(OR($B40=\"-\",$K42=\"-\",$I42<=0),\"\",VLOOKUP($B40,'Data source'!$B$15:$I$99,7,FALSE))","v":""},{"$f":"IF(OR($B40=\"-\",$K42=\"-\",$I42<=0),\"\",(($S42/$S$53)*AH42))","v":""},null,{"$f":"IF(OR($B40=\"-\",$K42=\"-\",$I42<=0),\"\",VLOOKUP($B40,'Data source'!$B$15:$I$99,8,FALSE))","v":""},{"$f":"IF(OR($B40=\"-\",$K42=\"-\",$I42<=0),\"\",(($S42/$S$53)*AK42))","v":""},null,null,null,null,{"$f":"IF(OR($B40=\"-\",$K42=\"-\",$I42=0),\"\",VLOOKUP($B40,'Data source'!$B$15:$M$99,12,FALSE))","v":""},{"$f":"IF(OR($B40=\"-\",$K42=\"-\",$I42=0),\"\",IF($AQ42=\"Dry\",$AP40/$R42/10,IF($AQ42=\"Wet\",$AP40/($U42/100)*$R42/10,0)))","v":""},{"$f":"IF(OR($B40=\"-\",$K42=\"-\",$I42=0),\"\",AR42/T42)","v":""},{"$f":"IF(OR($B40=\"-\",$K42=\"-\",$I42=0),\"\",($AR42*$I42)/100)","v":""},null,null,null,{"$f":"Z42","v":""},null,{"$f":"IF(OR($B40=\"-\",$K42=\"-\",$I42=0),\"\",VLOOKUP($B40,'Data source'!$B$15:$M$99,9,FALSE))","v":""},"",null,{"$f":"IF(OR($B40=\"-\",$K42=\"-\",$I42=0),\"\",VLOOKUP($B40,'Data source'!$B$15:$M$99,10,FALSE))","v":""},"",null,{"$f":"IF(OR($B40=\"-\",$K42=\"-\",$I42=0),\"\",VLOOKUP($B40,'Data source'!$B$15:$M$99,11,FALSE))","v":""},""]
[]
["Feed  5","PKE",null,"in trailer",null,null,1,null,null,null,null,{"$f":"IF(OR($D$16=\"-\",$D44=\"-\",$G44=0),0,G44)","v":1},null,null,null,null,null,{"$f":"IF(OR($B44=\"-\",$D44=\"-\",$G44=\"-\"),\"\",VLOOKUP($D44,'Data source'!$B$127:$C$137,2,FALSE))","v":0.85},{"$f":"IF(OR($B44=\"-\",$D44=\"-\",$G44=\"-\"),\"\",G44*R44)","v":0.85},{"$f":"IF(OR($B44=\"-\",$D44=\"-\",$G44=\"-\"),\"\",VLOOKUP($B44,'Data source'!$B$15:$I$99,3,FALSE))","v":11},{"$f":"IF(OR($B44=\"-\",$D44=\"-\",$G44=\"-\"),\"\",VLOOKUP($B44,'Data source'!$B$15:$I$99,2,FALSE))","v":90},{"$f":"IF(OR($B44=\"-\",$D44=\"-\",$G44=\"-\"),\"\",S44*T44)","v":9.35},null,null,{"$f":"IF(OR($B44=\"-\",$D44=\"-\",$G44=\"-\"),\"\",VLOOKUP($B44,'Data source'!$B$15:$I$99,4,FALSE))","v":14},{"$f":"IF(OR($B44=\"-\",$D44=\"-\",$G44=\"-\"),\"\",(($S44/$S$52)*Y44))","v":{"$error":"#N/A"}},null,{"$f":"IF(OR($B44=\"-\",$D44=\"-\",$G44=\"-\"),\"\",VLOOKUP($B44,'Data source'!$B$15:$I$99,5,FALSE))","v":54},{"$f":"IF(OR($B44=\"-\",$D44=\"-\",$G44=\"-\"),\"\",(($S44/$S$52)*AB44))","v":{"$error":"#N/A"}},null,{"$f":"IF(OR($B44=\"-\",$D44=\"-\",$G44=\"-\"),\"\",VLOOKUP($B44,'Data source'!$B$15:$I$99,6,FALSE))","v":0},{"$f":"IF(OR($B44=\"-\",$D44=\"-\",$G44=\"-\"),\"\",(($S44/$S$52)*AE44))","v":{"$error":"#N/A"}},null,{"$f":"IF(OR($B44=\"-\",$D44=\"-\",$G44=\"-\"),\"\",VLOOKUP($B44,'Data source'!$B$15:$I$99,7,FALSE))","v":5},{"$f":"IF(OR($B44=\"-\",$D44=\"-\",$G44=\"-\"),\"\",(($S44/$S$52)*AH44))","v":{"$error":"#N/A"}},null,{"$f":"IF(OR($B44=\"-\",$D44=\"-\",$G44=\"-\"),\"\",VLOOKUP($B44,'Data source'!$B$15:$I$99,8,FALSE))","v":8},{"$f":"IF(OR($B44=\"-\",$D44=\"-\",$G44=\"-\"),\"\",(($S44/$S$52)*AK44))","v":{"$error":"#N/A"}},null,null,null,160,{"$f":"IF(OR($B44=\"-\",$D44=\"-\",$G44=\"-\"),\"\",VLOOKUP($B44,'Data source'!$B$15:$M$99,12,FALSE))","v":"Wet"},{"$f":"IF(OR($B44=\"-\",$D44=\"-\",$G44=\"-\"),\"\",IF($AQ44=\"Dry\",$AP44/$R44/10,IF($AQ44=\"Wet\",$AP44/($U44/100)*$R44/10,0)))","v":15.111111111111111},{"$f":"IF(OR($B44=\"-\",$D44=\"-\",$G44=\"-\"),\"\",AR44/T44)","v":1.3737373737373737},{"$f":"IF(OR($B44=\"-\",$D44=\"-\",$G44=\"-\"),\"\",($AR44*$G44)/100)","v":0.15111111111111111},null,null,null,{"$f":"Z44","v":{"$error":"#N/A"}},null,{"$f":"IF(OR($B44=\"-\",$D44=\"-\",$G44=0),\"\",VLOOKUP($B44,'Data source'!$B$15:$M$99,9,FALSE))","v":1.6},{"$error":"#N/A"},null,{"$f":"IF(OR($B44=\"-\",$D44=\"-\",$G44=0),\"\",VLOOKUP($B44,'Data source'!$B$15:$M$99,10,FALSE))","v":80.8},{"$f":"IF(OR($AX44=\"\",$BC44=\"\"),\"\",$AX44*$BC44)","v":{"$error":"#N/A"}},null,{"$f":"IF(OR($B44=\"-\",$D44=\"-\",$G44=0),\"\",VLOOKUP($B44,'Data source'!$B$15:$M$99,11,FALSE))","v":98.4},{"$f":"IF(OR($AX44=\"\",$BF44=\"\"),\"\",$AX44*$BF44)","v":{"$error":"#N/A"}}]
[]
[null,null,null,"feed pad",null,null,null,null,0,null,{"$f":"IF(D46=\"-\",D44,D46)","v":"feed pad"},{"$f":"IF(OR($D$16=\"-\",D44=\"-\",$I46=0),0,I46)","v":0},null,null,null,null,null,{"$f":"IF(OR($B44=\"-\",$K46=\"-\",$I46<=0),\"\",VLOOKUP($K46,'Data source'!$B$127:$C$137,2,FALSE))","v":""},{"$f":"IF(OR($B44=\"-\",$K46=\"-\",$I46<=0),\"\",$I46*$R46)","v":""},{"$f":"IF(OR($B44=\"-\",$K46=\"-\",$I46<=0),\"\",VLOOKUP($B44,'Data source'!$B$15:$I$99,3,FALSE))","v":""},{"$f":"IF(OR($B44=\"-\",$K46=\"-\",$I46<=0),\"\",VLOOKUP($B44,'Data source'!$B$15:$I$99,2,FALSE))","v":""},{"$f":"IF(OR($B44=\"-\",$K46=\"-\",$I46<=0),\"\",$S46*$T46)","v":""},null,null,{"$f":"IF(OR($B44=\"-\",$K46=\"-\",$I46<=0),\"\",VLOOKUP($B44,'Data source'!$B$15:$I$99,4,FALSE))","v":""},{"$f":"IF(OR($B44=\"-\",$K46=\"-\",$I46<=0),\"\",(($S46/$S$53)*$Y46))","v":""},null,{"$f":"IF(OR($B44=\"-\",$K46=\"-\",$I46<=0),\"\",VLOOKUP($B44,'Data source'!$B$15:$I$99,5,FALSE))","v":""},{"$f":"IF(OR($B44=\"-\",$K46=\"-\",$I46<=0),\"\",(($S46/$S$53)*AB46))","v":""},null,{"$f":"IF(OR($B44=\"-\",$K46=\"-\",$I46<=0),\"\",VLOOKUP($B44,'Data source'!$B$15:$I$99,6,FALSE))","v":""},{"$f":"IF(OR($B44=\"-\",$K46=\"-\",$I46<=0),\"\",(($S46/$S$53)*AE46))","v":""},null,{"$f":"IF(OR($B44=\"-\",$K46=\"-\",$I46<=0),\"\",VLOOKUP($B44,'Data source'!$B$15:$I$99,7,FALSE))","v":""},{"$f":"IF(OR($B44=\"-\",$K46=\"-\",$I46<=0),\"\",(($S46/$S$53)*AH46))","v":""},null,{"$f":"IF(OR($B44=\"-\",$K46=\"-\",$I46<=0),\"\",VLOOKUP($B44,'Data source'!$B$15:$I$99,8,FALSE))","v":""},{"$f":"IF(OR($B44=\"-\",$K46=\"-\",$I46<=0),\"\",(($S46/$S$53)*AK46))","v":""},null,null,null,null,{"$f":"IF(OR($B44=\"-\",$K46=\"-\",$I46=0),\"\",VLOOKUP($B44,'Data source'!$B$15:$M$99,12,FALSE))","v":""},{"$f":"IF(OR($B44=\"-\",$K46=\"-\",$I46=0),\"\",IF($AQ46=\"Dry\",$AP44/$R46/10,IF($AQ46=\"Wet\",$AP44/($U46/100)*$R46/10,0)))","v":""},{"$f":"IF(OR($B44=\"-\",$K46=\"-\",$I46=0),\"\",AR46/T46)","v":""},{"$f":"IF(OR($B44=\"-\",$K46=\"-\",$I46=0),\"\",($AR46*$I46)/100)","v":""},null,null,null,{"$f":"Z46","v":""},null,{"$f":"IF(OR($B44=\"-\",$K46=\"-\",$I46=0),\"\",VLOOKUP($B44,'Data source'!$B$15:$M$99,9,FALSE))","v":""},"",null,{"$f":"IF(OR($B44=\"-\",$K46=\"-\",$I46=0),\"\",VLOOKUP($B44,'Data source'!$B$15:$M$99,10,FALSE))","v":""},{"$f":"IF(OR($AX46=\"\",$BC46=\"\"),\"\",$AX46*$BC46)","v":""},null,{"$f":"IF(OR($B44=\"-\",$K46=\"-\",$I46=0),\"\",VLOOKUP($B44,'Data source'!$B$15:$M$99,11,FALSE))","v":""},{"$f":"IF(OR($AX46=\"\",$BF46=\"\"),\"\",$AX46*$BF46)","v":""}]
[null,null,null,null,null,null,null,null,null,null,null,null,null,null,null,null,null,null,null,null,null,null,null,null,null,null,null,null,null,null,null,null,null,null,null,null,null,null,null,null,null,null,null,null,null,null,null,null,null,null,null,null,null,null,null,{"$f":"IF(OR($AX47=\"\",$BC47=\"\"),\"\",$AX47*$BC47)","v":""},null,null,{"$f":"IF(OR($AX47=\"\",$BF47=\"\"),\"\",$AX47*$BF47)","v":""}]
["Feed 6","Soyabean meal",null,"in trailer",null,null,4,null,null,null,null,{"$f":"IF(OR($D$16=\"-\",$D48=\"-\",$G48=0),0,G48)","v":4},null,null,null,null,null,{"$f":"IF(OR($B48=\"-\",$D48=\"-\",$G48=\"-\"),\"\",VLOOKUP($D48,'Data source'!$B$127:$C$137,2,FALSE))","v":0.85},{"$f":"IF(OR($B48=\"-\",$D48=\"-\",$G48=\"-\"),\"\",G48*R48)","v":3.4},{"$f":"IF(OR($B48=\"-\",$D48=\"-\",$G48=\"-\"),\"\",VLOOKUP($B48,'Data source'!$B$15:$I$99,3,FALSE))","v":12.9},{"$f":"IF(OR($B48=\"-\",$D48=\"-\",$G48=\"-\"),\"\",VLOOKUP($B48,'Data source'!$B$15:$I$99,2,FALSE))","v":90},{"$f":"IF(OR($B48=\"-\",$D48=\"-\",$G48=0),\"\",S48*T48)","v":43.86},null,null,{"$f":"IF(OR($B48=\"-\",$D48=\"-\",$G48=\"-\"),\"\",VLOOKUP($B48,'Data source'!$B$15:$I$99,4,FALSE))","v":50},{"$f":"IF(OR($B48=\"-\",$D48=\"-\",$G48=\"-\"),\"\",(($S48/$S$52)*Y48))","v":{"$error":"#N/A"}},null,{"$f":"IF(OR($B48=\"-\",$D48=\"-\",$G48=\"-\"),\"\",VLOOKUP($B48,'Data source'!$B$15:$I$99,5,FALSE))","v":14},{"$f":"IF(OR($B48=\"-\",$D48=\"-\",$G48=\"-\"),\"\",(($S48/$S$52)*AB48))","v":{"$error":"#N/A"}},null,{"$f":"IF(OR($B48=\"-\",$D48=\"-\",$G48=\"-\"),\"\",VLOOKUP($B48,'Data source'!$B$15:$I$99,6,FALSE))","v":27},{"$f":"IF(OR($B48=\"-\",$D48=\"-\",$G48=\"-\"),\"\",(($S48/$S$52)*AE48))","v":{"$error":"#N/A"}},null,{"$f":"IF(OR($B48=\"-\",$D48=\"-\",$G48=\"-\"),\"\",VLOOKUP($B48,'Data source'!$B$15:$I$99,7,FALSE))","v":90},{"$f":"IF(OR($B48=\"-\",$D48=\"-\",$G48=\"-\"),\"\",(($S48/$S$52)*AH48))","v":{"$error":"#N/A"}},null,{"$f":"IF(OR($B48=\"-\",$D48=\"-\",$G48=\"-\"),\"\",VLOOKUP($B48,'Data source'!$B$15:$I$99,8,FALSE))","v":1.4},{"$f":"IF(OR($B48=\"-\",$D48=\"-\",$G48=\"-\"),\"\",(($S48/$S$52)*AK48))","v":{"$error":"#N/A"}},null,null,null,70,{"$f":"IF(OR($B48=\"-\",$D48=\"-\",$G48=\"-\"),\"\",VLOOKUP($B48,'Data source'!$B$15:$M$99,12,FALSE))","v":"Wet"},{"$f":"IF(OR($B48=\"-\",$D48=\"-\",$G48=\"-\"),\"\",IF($AQ48=\"Dry\",$AP48/$R48/10,IF($AQ48=\"Wet\",$AP48/($U48/100)*$R48/10,0)))","v":6.6111111111111098},{"$f":"IF(OR($B48=\"-\",$D48=\"-\",$G48=\"-\"),\"\",AR48/T48)","v":0.51248923341946584},{"$f":"IF(OR($B48=\"-\",$D48=\"-\",$G48=\"-\"),\"\",($AR48*$G48)/100)","v":0.26444444444444437},null,null,null,{"$f":"Z48","v":{"$error":"#N/A"}},null,{"$f":"IF(OR($B48=\"-\",$D48=\"-\",$G48=0),\"\",VLOOKUP($B48,'Data source'!$B$15:$M$99,9,FALSE))","v":35},{"$f":"IF(OR(AX48=\"\",AZ48=\"\"),\"\",AX48*AZ48)","v":{"$error":"#N/A"}},null,{"$f":"IF(OR($B48=\"-\",$D48=\"-\",$G48=0),\"\",VLOOKUP($B48,'Data source'!$B$15:$M$99,10,FALSE))","v":20},{"$f":"IF(OR($AX48=\"\",$BC48=\"\"),\"\",$AX48*$BC48)","v":{"$error":"#N/A"}},null,{"$f":"IF(OR($B48=\"-\",$D48=\"-\",$G48=0),\"\",VLOOKUP($B48,'Data source'!$B$15:$M$99,11,FALSE))","v":65},{"$f":"IF(OR($AX48=\"\",$BF48=\"\"),\"\",$AX48*$BF48)","v":{"$error":"#N/A"}}]
[]
[null,null,null,"-",null,null,null,null,1,null,{"$f":"IF(D50=\"-\",D48,D50)","v":"in trailer"},{"$f":"IF(OR($D$16=\"-\",D48=\"-\",$I50=0),0,I50)","v":1},null,null,null,null,null,{"$f":"IF(OR($B48=\"-\",$K50=\"-\",$I50<=0),\"\",VLOOKUP($K50,'Data source'!$B$127:$C$137,2,FALSE))","v":0.85},{"$f":"IF(OR($B48=\"-\",$K50=\"-\",$I50<=0),\"\",$I50*$R50)","v":0.85},{"$f":"IF(OR($B48=\"-\",$K50=\"-\",$I50<=0),\"\",VLOOKUP($B48,'Data source'!$B$15:$I$99,3,FALSE))","v":12.9},{"$f":"IF(OR($B48=\"-\",$K50=\"-\",$I50<=0),\"\",VLOOKUP($B48,'Data source'!$B$15:$I$99,2,FALSE))","v":90},{"$f":"IF(OR($B48=\"-\",$K50=\"-\",$I50<=0),\"\",$S50*$T50)","v":10.965},null,null,{"$f":"IF(OR($B48=\"-\",$K50=\"-\",$I50<=0),\"\",VLOOKUP($B48,'Data source'!$B$15:$I$99,4,FALSE))","v":50},{"$f":"IF(OR($B48=\"-\",$K50=\"-\",$I50<=0),\"\",(($S50/$S$53)*$Y50))","v":{"$error":"#N/A"}},null,{"$f":"IF(OR($B48=\"-\",$K50=\"-\",$I50<=0),\"\",VLOOKUP($B48,'Data source'!$B$15:$I$99,5,FALSE))","v":14},{"$f":"IF(OR($B48=\"-\",$K50=\"-\",$I50<=0),\"\",(($S50/$S$53)*AB50))","v":{"$error":"#N/A"}},null,{"$f":"IF(OR($B48=\"-\",$K50=\"-\",$I50<=0),\"\",VLOOKUP($B48,'Data source'!$B$15:$I$99,6,FALSE))","v":27},{"$f":"IF(OR($B48=\"-\",$K50=\"-\",$I50<=0),\"\",(($S50/$S$53)*AE50))","v":{"$error":"#N/A"}},null,{"$f":"IF(OR($B48=\"-\",$K50=\"-\",$I50<=0),\"\",VLOOKUP($B48,'Data source'!$B$15:$I$99,7,FALSE))","v":90},{"$f":"IF(OR($B48=\"-\",$K50=\"-\",$I50<=0),\"\",(($S50/$S$53)*AH50))","v":{"$error":"#N/A"}},null,{"$f":"IF(OR($B48=\"-\",$K50=\"-\",$I50<=0),\"\",VLOOKUP($B48,'Data source'!$B$15:$I$99,8,FALSE))","v":1.4},{"$f":"IF(OR($B48=\"-\",$K50=\"-\",$I50<=0),\"\",(($S50/$S$53)*AK50))","v":{"$error":"#N/A"}},null,null,null,null,{"$f":"IF(OR($B48=\"-\",$K50=\"-\",$I50=0),\"\",VLOOKUP($B48,'Data source'!$B$15:$M$99,12,FALSE))","v":"Wet"},{"$f":"IF(OR($B48=\"-\",$K50=\"-\",$I50=0),\"\",IF($AQ50=\"Dry\",$AP48/$R50/10,IF($AQ50=\"Wet\",$AP48/($U50/100)*$R50/10,0)))","v":6.6111111111111098},{"$f":"IF(OR($B48=\"-\",$K50=\"-\",$I50=0),\"\",AR50/T50)","v":0.51248923341946584},{"$f":"IF(OR($B48=\"-\",$K50=\"-\",$I50=0),\"\",($AR50*$I50)/100)","v":6.6111111111111093E-2},null,null,null,{"$f":"Z50","v":{"$error":"#N/A"}},null,{"$f":"IF(OR($B48=\"-\",$K50=\"-\",$I50=0),\"\",VLOOKUP($B48,'Data source'!$B$15:$M$99,9,FALSE))","v":35},null,null,{"$f":"IF(OR($B48=\"-\",$K50=\"-\",$I50=0),\"\",VLOOKUP($B48,'Data source'!$B$15:$M$99,10,FALSE))","v":20},null,null,{"$f":"IF(OR($B48=\"-\",$K50=\"-\",$I50=0),\"\",VLOOKUP($B48,'Data source'!$B$15:$M$99,11,FALSE))","v":65}]
[null,null,null,null,null,null,null,null,null,null,null,null,null,null,null,null,null,null,null,null,null,null,null,null,null,null,null,null,null,null,null,null,null,null,null,null,null,null,null,null,null,null,null,null,null,null,null,null,null,"Total in diet"]
[null,null,null,null,null,null,"OPTION 1",null,"OPTION 2",null,null,null,null,null,null,null,"OPTION 1",null,{"$f":"SUM(S24,S28,S32,S36,S40,S44,S48)","v":{"$error":"#N/A"}},null,null,{"$f":"SUM(V24,V28,V32,V36,V40,V44,V48)","v":{"$error":"#N/A"}},null,null,null,{"$f":"SUM(Z24,Z28,Z32,Z36,Z40,Z44,Z48)","v":{"$error":"#N/A"}},null,null,{"$f":"SUM(AC24,AC28,AC32,AC36,AC40,AC44,AC48)","v":{"$error":"#N/A"}},null,null,{"$f":"SUM(AF24,AF28,AF32,AF36,AF40,AF44,AF48)","v":{"$error":"#N/A"}},null,null,{"$f":"SUM(AI24,AI28,AI32,AI36,AI40,AI44,AI48)","v":{"$error":"#N/A"}},null,null,{"$f":"SUM(AL24,AL28,AL32,AL36,AL40,AL44,AL48)","v":{"$error":"#N/A"}},null,null,null,"$ for mob",{"$f":"$AT$52*$G$8","v":{"$error":"#N/A"}},null,"$ per cow",{"$f":"SUM(AT24,AT28,AT32,AT36,AT40,AT44,AT48)","v":{"$error":"#N/A"}},null,null,null,{"$f":"$Z$52","v":{"$error":"#N/A"}},null,{"$f":"SUM(BA24,BA28,BA32,BA36,BA40,BA44,BA48)/$AX$52","v":{"$error":"#N/A"}},null,null,{"$f":"SUM(BD24,BD28,BD32,BD36,BD40,BD44,BD48)/$AX$52","v":{"$error":"#N/A"}},null,null,{"$f":"SUM(BG24,BG28,BG32,BG36,BG40,BG44,BG48)/$AX$52","v":{"$error":"#N/A"}}]
[null,null,null,"Total kg DM offered",null,null,{"$f":"SUM(L24,L28,L32,L36,L40,L44,L48)","v":22},null,{"$f":"SUM(L26,L30,L34,L38,L42,L46,L50)","v":19},null,null,null,null,null,null,null,"OPTION 2",null,{"$f":"SUM(S26,S30,S34,S38,S42,S46,S50)","v":{"$error":"#N/A"}},null,null,{"$f":"SUM(V26,V30,V34,V38,V42,V46,V50)","v":{"$error":"#N/A"}},null,null,null,{"$f":"SUM(Z26,Z30,Z34,Z38,Z42,Z46,Z50)","v":{"$error":"#N/A"}},null,null,{"$f":"SUM(AC26,AC30,AC34,AC38,AC42,AC46,AC50)","v":{"$error":"#N/A"}},null,null,{"$f":"SUM(AF26,AF30,AF34,AF38,AF42,AF46,AF50)","v":{"$error":"#N/A"}},null,null,{"$f":"SUM(AI26,AI30,AI34,AI38,AI42,AI46,AI50)","v":{"$error":"#N/A"}},null,null,{"$f":"SUM(AL26,AL30,AL34,AL38,AL42,AL46,AL50)","v":{"$error":"#N/A"}},null,null,null,null,{"$f":"$AT$53*$K$8","v":{"$error":"#N/A"}},null,null,{"$f":"SUM(AT26,AT30,AT34,AT38,AT42,AT46,AT50)","v":{"$error":"#N/A"}},null,null,null,{"$f":"$Z$53","v":{"$error":"#N/A"}},null,{"$f":"SUM(BA26,BA30,BA34,BA38,BA42,BA46,BA50)/$AX$53","v":{"$error":"#N/A"}},null,null,{"$f":"SUM(BD26,BD30,BD34,BD38,BD42,BD46,BD50)/$AX$53","v":{"$error":"#N/A"}},null,null,{"$f":"SUM(BG26,BG30,BG34,BG38,BG42,BG46,BG50)/$AX$53","v":{"$error":"#N/A"}}]
[]
[null,null,null,null,null,null,null,null,null,null,null,null,null,null,null,null,"WARNINGS"]
[null,null,null,null,null,null,null,null,null,null,null,null,null,null,null,null,"DM",null,{"$f":"IF(AND(T16<-0.5,T18<-0.5),\"Both\",IF(T16<-0.5,\"Curr.\",IF(T18<-0.5,\"Prop.\",\"\")))","v":{"$error":"#N/A"}},{"$f":"IF(OR(T16<-0.5,T18<-0.5),\"Dry matter intake is less than required\",\" \")","v":{"$error":"#N/A"}}]
[null,null,null,null,null,null,null,null,null,null,null,null,null,null,null,null,"NDF",null,{"$f":"IF(AND(AC15<35,AC17<35),\"Both\",IF(AC15<35,\"Curr.\",IF(AC17<35,\"Prop.\",\"\")))","v":{"$error":"#N/A"}},{"$f":"IF(OR(AC15<35,AC17<35),\"Neutral detergent fibre levels are below recommended value. Add more fibre to the diet (e.g. silage/pasture) or reduce starch based supplements\",\" \")","v":{"$error":"#N/A"}}]
[null,null,null,null,null,null,null,null,null,null,null,null,null,null,null,null,"SS",null,{"$f":"IF(AND(AF15>=38,AF17>=38),\"Both\",IF(AF15>=38,\"Curr.\",IF(AF17>=38,\"Prop.\",\"\")))","v":{"$error":"#N/A"}},{"$f":"IF(OR(AF15>=38,AF17>=38),\"Soluble sugar and starch levels are greater than reccomended. Reduce supplements high in starch or sugars (e.g. barley/maize grain\",\" \")","v":{"$error":"#N/A"}}]
[null,null,null,null,null,null,null,null,null,null,null,null,null,null,null,null,"Starch",null,{"$f":"IF(AND(AI15>30,AI17>=30),\"Both\",IF(AI15>30,\"Curr.\",IF(AI17>=30,\"Prop.\",\"\")))","v":{"$error":"#N/A"}},{"$f":"IF(OR(AI15>30,AI17>=30),\"Starch levels in the diet are greater than reccomended. Reduce supplements that are high in starch (e.g. barley or wheat)\",\" \")","v":{"$error":"#N/A"}}]
[null,null,null,null,null,null,null,null,null,null,null,null,null,null,null,null,"Fat",null,{"$f":"IF(AND(AL15>8,AL17>8),\"Both\",IF(AL15>8,\"Curr.\",IF(AL17>8,\"Prop.\",\"\")))","v":{"$error":"#N/A"}},{"$f":"IF(OR(AL15>8,AL17>8),\"Fat levels in the diet are greater than reccomended. Reduce feeds high in unsaturated fats (e.g. sunflower oil\",\" \")","v":{"$error":"#N/A"}}]
[null,null,null,null,null,null,null,null,null,null,null,null,null,null,null,null,"Total Protein",null,{"$f":"IF(AND(Z15<Z13,Z17<Z13),\"Both\",IF(Z15<Z13,\"Curr.\",IF(Z17<Z13,\"Prop.\",\"\")))","v":{"$error":"#N/A"}},{"$f":"IF(OR(Z15<Z13,Z17<Z13),\"Protein levels are below recommended values; however, it is often not economical to use an expensive protein supplement.  See Example in Extra Info  tab\",\" \")","v":{"$error":"#N/A"}}]
[null,null,null,null,null,null,null,null,null,null,null,null,null,null,null,null,"UDP",null,null,{"$f":"IF(AND((AZ52+BF52)<100,AZ52>35),\" \",\"UDP levels are below recommended values; however, other factors such as passage rate and total dietary protein content need to be taken into account.  See FeedRight TechNote 15 for more information\")","v":{"$error":"#N/A"}}]
[null,null,null,null,null,null,null,null,null,null,null,null,null,null,null,null,"Soluble",null,null,{"$f":"IF(AND((AZ52+BC52)<100,AZ52>32),\" \",\"Soluble protein levels are below recommended values; however, other factors such as passage rate and total dietary protein content need to be taken into account.  See FeedRight TechNote 15 for more information\")","v":{"$error":"#N/A"}}]
[null,null,null,null,null,null,null,null,null,null,null,null,null,null,null,null,"RDP",null,null,{"$f":"IF(AND((AZ52+BF52)<100,BF52<65),\" \",\"RDP levels are above recommended values; however, other factors such as passage rate and total dietary protein content need to be taken into account before dietary changes are made.  See FeedRight TechNote 15 for more information\")","v":{"$error":"#N/A"}}]
[]
[null,null,null,null,null,null,null,null,null,null,null,null,null,null,null,"RDP = rumen degradable protein"]
[null,null,null,null,null,null,null,null,null,null,null,null,null,null,null,"UDP = undegradable dietary protein"]

{"sheet":"Extra info","index":9,"n_rows":5,"n_cols":3,"rows_kept":5,"cut":false,"hidden":false,"merged":[]}
["daily BCS gain"]
[]
["monthly BCS gain ",0.1,"BCS"]
["monthly LWT gain",{"$f":"33*B3","v":3.3000000000000003},"kg"]
["daily LWT gain",{"$f":"B4/31","v":0.10645161290322581},"kg"]

{"sheet":"Sheet2","index":10,"n_rows":0,"n_cols":0,"rows_kept":0,"cut":false,"hidden":true,"merged":[]}

{"sheet":"Data source","index":11,"n_rows":264,"n_cols":87,"rows_kept":264,"cut":false,"hidden":true,"merged":[]}
[null,"Supplement","DM ","ME","CP","NDF","SSS","starch","fat","BP P","Sol P","Degrad P","Dry/Wet","Na","K","Cl","S","Mg","Ca","P"]
["FEED",null,"%","MJ /kg DM","% DM","% DM","% DM","% SSS","% DM","% CP","% CP","% CP","$","%DM","%DM","%DM","%DM","%DM","%DM","%DM"]
["Pasture"]
[null,"Autumn and winter",16,11,17,44,16,3,4,0,0,0,"Dry",0.35,3.6,1.3,0.4,0.25,0.45,0.4]
[null,"Autumn & winter -Irrigated",17,12,25,43,19,3,4,0,0,0,"Dry",0.35,3.6,1.3,0.4,0.25,0.45,0.4]
[null,"Spring",14.000000000000002,12,27,41,16,3,4,25,37.5,{"$f":"100-J6","v":75},"Dry",0.35,3.6,1.3,0.4,0.25,0.7,0.4,null,null,null,null,"kolver"]
[null,"Spring - Irrigated",17,12,24,40,20,3,4,25,37.5,75,"Dry",0.35,3.6,1.3,0.4,0.25,0.7,0.4,null,null,null,null,"est"]
[null,"Summer - leafy",17,11,18,47,16,3,4,30,27.5,{"$f":"100-J8","v":70},"Dry",0.35,3.6,1.3,0.4,0.25,0.5,0.4,null,null,null,null,"kolver"]
[null,"Summer - leafy - irrigated",17,12,24,43,20,3,4,30,27.5,70,"Dry",0.35,3.6,1.3,0.4,0.25,0.5,0.4,null,null,null,null,"est"]
[null,"Summer - stalky",25,10,15,50,9,3,3,40,20,{"$f":"100-J10","v":60},"Dry",0.35,3.6,1.3,0.4,0.25,0.5,0.4,null,null,null,null,"kolver"]
[null,"Kikuyu - leafy",25,10,18,70,4.5,90,0,0,0,0,"Dry",0.35,3.6,1.3,0.4,0.25,0.5,0.4]
[null,"Kikuyu - stemmy",50,8,8,65,4.5,90,0,0,0,0,"Dry",0.35,3.6,1.3,0.4,0.25,0.5,0.4,null,null,null,null,null,null,null,null,null,null,null,null,null,null,null,null,null,null,null,null,null,null,null,null,null,null,null,null,null,null,null,null,null,null,null,null,null,null,null,null,null,null,null,null,null,null,null,null,null,null,null,null,null,null,null,null,null,null,null,null,null,null,null,null,null,null,{"$f":"IF($CI$10>=12,0,IF($CI$10<=2,VLOOKUP($H$8,'Data source'!B190:H199,7,IF($CI$10<=4,VLOOKUP($H$8,'Data source'!B190:H199,6,IF($CI$10<=8,VLOOKUP($H$8,'Data source'!B190:H199,5,IF($CI$10<=12,VLOOKUP($H$8,'Data source'!B190:H199,4,FALSE)))))))))","v":{"$error":"#N/A"}}]
[null,""]
[null,""]
["Hay & Silage"]
[null,"Hay - pasture - good",85,9.6999999999999993,17,54,18,44,2.6,31,31,{"$f":"100-J16","v":69},"Dry",0.2,2.3199999999999998,0.62,0.26,0.2,0.8,0.4,"Table 4.2 Technote 4"]
[null,"Hay - pasture - poor",85,7.3,7,66,15,45,2.6,37,29,63,"Dry",0.15,1.67,0.6,0.2,0.18,0.4,0.3,"Table 4.2 Technote 4"]
[null,"Straw - cereal",88,7,5,80,8,100,2,76,20,24,"Dry",0.1,2,0.67,0.17,0.23,0.3,0.1,"Barley straw but there is also wheat straw",null,null,null,"kolver"]
[null,"Silage -pasture - good",23,10,17,45,22,7,3,22,52,78,"Dry",0.1,2.2999999999999998,0.2,0.24,0.21,0.3,0.3,"Table 4.2 Technote 4"]
[null,"Silage - pasture - poor",38,9,15,55,15,8,3.1,29,44,71,"Dry",0.16,2,0.19,0.2,0.14000000000000001,0.55000000000000004,0.28000000000000003,"Table 4.2 Technote 4"]
[null,"Silage - maize - good",35,11,8,43,35,77,3,31,48,69,"Dry",0.01,1.2,0.4,0.13,0.18,0.23,0.25,"only one value given for maize grain",null,null,null,"kolver"]
[null,"Silage - maize - poor",31,10,8,47,30,75,3,18.5,57.8,81.5,"Dry",0.01,1.2,0.4,0.13,0.18,0.23,0.25,null,null,null,null,"nrc2001"]
[null,"Silage -whole crop",37,10,8,57,23,77,4,0,0,0,"Dry",7.0000000000000007E-2,2.85,7.0000000000000007E-2,0.25,0.2,0.32,0.56999999999999995,"for whole crop"]
[null,"Silage -lucerne",20,9.5,20,51,17,45,3.5,23,54,{"$f":"100-J24","v":77},"Dry",0.05,2.84,0.34,0.28999999999999998,0.25,1.29,0.28999999999999998,"Table 4.2 Technote 4",null,null,null,"kolver"]
[null,"Silage - cereal",36,10.5,13,59,16.100000000000001,100,3.6,0,0,0,"dry",7.0000000000000007E-2,2.85,7.0000000000000007E-2,0.25,0.2,0.56999999999999995,0.32,"F&F"]
[null,"Baleage",40,10.5,15,50,8,3,3,0,0,0,"Dry",0.46,1.79,0.28999999999999998,0.06,0.12,0.18,0.4]
[null,""]
["Concentrates"]
[null,"Barley",89,13,11,21,61,90,2,27,31,{"$f":"100-J29","v":73},"Wet",0.03,0.56999999999999995,0.18,0.17,0.18,0.06,0.44,"Table 4.2 Technote 4"]
[null,"Bran (wheat)",85,9.8000000000000007,17.100000000000001,51,21,95,4.4000000000000004,29,42,{"$f":"100-J30","v":71},"Wet",0.04,1.5,0.05,0.25,0.6,0.13,1.31,"Table 4.2 Technote 4"]
[null,"Canola meal",90,11.5,38,30,0,1.5,3.5,0,0,0,"Wet",7.0000000000000007E-2,1.41,0.04,0.73,0.53,0.75,1.1000000000000001,"Table 4.2 Technote 4"]
[null,"Maize grain",89,13.6,8,9,75,99,4.3,52,12,{"$f":"100-J32","v":48},"Wet",3.0000000000000001E-3,0.4,0.05,0.12,0.12,0.02,0.31,"Table 4.2 Technote 4"]
[null,"Oats",89,11.5,13,31,48,90,4.9000000000000004,17,27,{"$f":"100-J33","v":83},"Wet",0.01,0.53,0.11,0.19,0.15,0.1,0.41,"Table 4.2 Technote 4"]
[null,"Soyabean hulls",88,12,13.5,60,14,1.4,2.5,5.3,22.5,{"$f":"100-J34","v":94.7},"Wet",0.01,1.51,0.05,0.12,0.25,0.53,0.18,"Table 4.2 Technote 4"]
[null,"Soyabean meal",90,12.9,50,14,27,90,1.4,35,20,{"$f":"100-J35","v":65},"Wet",0.01,2.12,0.08,0.37,0.3,0.3,0.68,"Table 4.2 Technote 4"]
[null,"Tapioca",88,12.8,5,20,74,71,2,0,0,0,"Wet",0,1.1000000000000001,0,0,0.15,0.2,0,"Table 4.2 Technote 4"]
[null,"Wheat",89,12.6,11.3,14,70,90,1.9,29,42,{"$f":"100-J37","v":71},"Wet",0.01,0.46,0.08,0.16,0.13,7.0000000000000007E-2,0.36,"Table 4.2 Technote 4"]
[null,""]
[null,""]
["Forages and crops"]
[null,"Chicory",13,12.5,23,34,7,0,0,0,0,0,"Dry",0.21,3.64,0.2,0.3,0.28000000000000003,1.49,0.34,"Table 4.2 Technote 4"]
[null,"Kale",13,12,15,27,37,0,2.1,0,0,0,"Dry",0.1,4,0.2,0.7,0.5,0.8,0.35,"Table 4.2 Technote 4"]
[null,"Lucerne",24,11,30,0,0,0,2.5,0,0,0,"Dry",0.06,2.5,0.35,0.3,0.25,1.6,0.3,"Table 4.2 Technote 4"]
[null,"Swedes",11,12,16,23,47,0.1,null,0,0,0,"Dry",0.2,0.5,0.2,0.7,0.1,0.4,0.35,"Table 4.2 Technote 4"]
[null,"Turnips",10,12,15,27,17,10,2,0,0,0,"Dry",0.28000000000000003,3,1.45,0.33,0.23,1.75,0.37,"Table 4.2 Technote 4"]
[null,"Fodder beet - bulb",10,12,8.6,11.4,64,5,0,0,0,0,"Dry",0.3,2,0.3,7.0000000000000007E-2,0.16,0.14000000000000001,0.13,"Literature review SFF Fodder beet"]
[null,"Fodder beet - leaf",17,10.4,20,32,17.5,0,0,0,0,0,"Dry",1.3,3.2,0.3,0.3,1,1.8,0.3,"Literature review SFF Fodder beet"]
[]
[]
[null,""]
["By-products"]
[null,"PKE",90,11,14,54,0,5,8,1.6,80.8,{"$f":"100-J52","v":98.4},"Wet",0.02,0.8,0.25,0.24,0.3,0.25,0.65,"Table 4.2 Technote 4"]
[null,"Apple pomace",22,10.4,5.4,41,44,100,4.7,51,11,{"$f":"100-J53","v":49},"Wet",0,0.53,0,0.11,0,0.23,0.11,"Table 4.2 Technote 4"]
[null,"Brewers grain",24,10,23,49,7,100,7.3,45,10,{"$f":"100-J54","v":55},"Wet",0.2,0.1,0.17,0.36,0.1,0.3,0.6,"Table 4.2 Technote 4"]
[null,"Broll",85,10.5,13,12,22,90,5,0,0,0,"Wet",0.01,1.5,0.09,0.19,0.5,0.15,0.8,"Table 4.2 Technote 4"]
[null,"DDG (Dried distillers grain)",90,12.5,29,30,4,90,9,17.100000000000001,18.3,{"$f":"100-J56","v":82.9},"Wet",0.3,0.1,0.26,0.44,0.33,0.18,0.83,"Table 4.2 Technote 4"]
[null,"Molasses",75,12,4,0,83,0,0.1,0,95,{"$f":"100-J57","v":100},"Wet",0.15,3.3,3.1,0.47,0.43,1.1000000000000001,0.09,"Table 4.2 Technote 4"]
[null,"Potatoes",23,13,10,7.6,77,100,0.4,5,4.5,{"$f":"100-J58","v":95},"Wet",0.09,2.17,0.28000000000000003,0.09,0.14000000000000001,0.04,0.24,"Table 4.2 Technote 4"]
[null,"Urea",99,0,281,0,0,0,0,0,0,0,"Wet",0,0,0,0,0,0,0,"Table 4.2 Technote 4"]
[null,""]
["custom",""]
["Crops_Fodder_beet_Default",{"$f":"'CUSTOM FEED SET-UP'!B4","v":"Fodder beet_Default"}]
[null,{"$f":"'CUSTOM FEED SET-UP'!B5","v":"Bulb only"},{"$f":"'CUSTOM FEED SET-UP'!E5","v":10},{"$f":"'CUSTOM FEED SET-UP'!F5","v":12},{"$f":"'CUSTOM FEED SET-UP'!G5","v":8.6},{"$f":"'CUSTOM FEED SET-UP'!H5","v":11.4},{"$f":"'CUSTOM FEED SET-UP'!I5","v":64},{"$f":"'CUSTOM FEED SET-UP'!J5","v":5},{"$f":"'CUSTOM FEED SET-UP'!K5","v":0},{"$f":"'CUSTOM FEED SET-UP'!L5","v":0},{"$f":"'CUSTOM FEED SET-UP'!M5","v":0},{"$f":"'CUSTOM FEED SET-UP'!N5","v":0},{"$f":"'CUSTOM FEED SET-UP'!O5","v":"Dry"},{"$f":"'CUSTOM FEED SET-UP'!P5","v":0.3},{"$f":"'CUSTOM FEED SET-UP'!Q5","v":2},{"$f":"'CUSTOM FEED SET-UP'!R5","v":0.3},{"$f":"'CUSTOM FEED SET-UP'!S5","v":7.0000000000000007E-2},{"$f":"'CUSTOM FEED SET-UP'!T5","v":0.16},{"$f":"'CUSTOM FEED SET-UP'!U5","v":0.14000000000000001},{"$f":"'CUSTOM FEED SET-UP'!V5","v":0.13}]
[null,{"$f":"'CUSTOM FEED SET-UP'!B6","v":"Leaf only"},{"$f":"'CUSTOM FEED SET-UP'!E6","v":17},{"$f":"'CUSTOM FEED SET-UP'!F6","v":10.4},{"$f":"'CUSTOM FEED SET-UP'!G6","v":20},{"$f":"'CUSTOM FEED SET-UP'!H6","v":32},{"$f":"'CUSTOM FEED SET-UP'!I6","v":17.5},{"$f":"'CUSTOM FEED SET-UP'!J6","v":0},{"$f":"'CUSTOM FEED SET-UP'!K6","v":0},{"$f":"'CUSTOM FEED SET-UP'!L6","v":0},{"$f":"'CUSTOM FEED SET-UP'!M6","v":0},{"$f":"'CUSTOM FEED SET-UP'!N6","v":0},{"$f":"'CUSTOM FEED SET-UP'!O6","v":"Dry"},{"$f":"'CUSTOM FEED SET-UP'!P6","v":1.3},{"$f":"'CUSTOM FEED SET-UP'!Q6","v":3.2},{"$f":"'CUSTOM FEED SET-UP'!R6","v":0.3},{"$f":"'CUSTOM FEED SET-UP'!S6","v":0.3},{"$f":"'CUSTOM FEED SET-UP'!T6","v":1},{"$f":"'CUSTOM FEED SET-UP'!U6","v":1.8},{"$f":"'CUSTOM FEED SET-UP'!V6","v":0.3}]
[null,{"$f":"'CUSTOM FEED SET-UP'!B7","v":"Bulb 90% Leaf 10%"},{"$f":"'CUSTOM FEED SET-UP'!E7","v":10.7},{"$f":"'CUSTOM FEED SET-UP'!F7","v":11.84},{"$f":"'CUSTOM FEED SET-UP'!G7","v":9.74},{"$f":"'CUSTOM FEED SET-UP'!H7","v":13.46},{"$f":"'CUSTOM FEED SET-UP'!I7","v":59.35},{"$f":"'CUSTOM FEED SET-UP'!J7","v":4.5},{"$f":"'CUSTOM FEED SET-UP'!K7","v":0},{"$f":"'CUSTOM FEED SET-UP'!L7","v":0},{"$f":"'CUSTOM FEED SET-UP'!M7","v":0},{"$f":"'CUSTOM FEED SET-UP'!N7","v":0},{"$f":"'CUSTOM FEED SET-UP'!O7","v":"Dry"},{"$f":"'CUSTOM FEED SET-UP'!P7","v":0.4},{"$f":"'CUSTOM FEED SET-UP'!Q7","v":2.12},{"$f":"'CUSTOM FEED SET-UP'!R7","v":0.30000000000000004},{"$f":"'CUSTOM FEED SET-UP'!S7","v":9.2999999999999999E-2},{"$f":"'CUSTOM FEED SET-UP'!T7","v":0.24400000000000002},{"$f":"'CUSTOM FEED SET-UP'!U7","v":0.30599999999999999},{"$f":"'CUSTOM FEED SET-UP'!V7","v":0.14700000000000002}]
[null,{"$f":"'CUSTOM FEED SET-UP'!B8","v":"Bulb 85% Leaf 15%"},{"$f":"'CUSTOM FEED SET-UP'!E8","v":11.05},{"$f":"'CUSTOM FEED SET-UP'!F8","v":11.76},{"$f":"'CUSTOM FEED SET-UP'!G8","v":10.309999999999999},{"$f":"'CUSTOM FEED SET-UP'!H8","v":14.489999999999998},{"$f":"'CUSTOM FEED SET-UP'!I8","v":57.024999999999999},{"$f":"'CUSTOM FEED SET-UP'!J8","v":4.25},{"$f":"'CUSTOM FEED SET-UP'!K8","v":0},{"$f":"'CUSTOM FEED SET-UP'!L8","v":0},{"$f":"'CUSTOM FEED SET-UP'!M8","v":0},{"$f":"'CUSTOM FEED SET-UP'!N8","v":0},{"$f":"'CUSTOM FEED SET-UP'!O8","v":"Dry"},{"$f":"'CUSTOM FEED SET-UP'!P8","v":0.45},{"$f":"'CUSTOM FEED SET-UP'!Q8","v":2.1799999999999997},{"$f":"'CUSTOM FEED SET-UP'!R8","v":0.3},{"$f":"'CUSTOM FEED SET-UP'!S8","v":0.10450000000000001},{"$f":"'CUSTOM FEED SET-UP'!T8","v":0.28600000000000003},{"$f":"'CUSTOM FEED SET-UP'!U8","v":0.38900000000000001},{"$f":"'CUSTOM FEED SET-UP'!V8","v":0.1555}]
[null,{"$f":"'CUSTOM FEED SET-UP'!B9","v":"Bulb 80% Leaf 20%"},{"$f":"'CUSTOM FEED SET-UP'!E9","v":11.4},{"$f":"'CUSTOM FEED SET-UP'!F9","v":11.68},{"$f":"'CUSTOM FEED SET-UP'!G9","v":10.879999999999999},{"$f":"'CUSTOM FEED SET-UP'!H9","v":15.52},{"$f":"'CUSTOM FEED SET-UP'!I9","v":54.7},{"$f":"'CUSTOM FEED SET-UP'!J9","v":4},{"$f":"'CUSTOM FEED SET-UP'!K9","v":0},{"$f":"'CUSTOM FEED SET-UP'!L9","v":0},{"$f":"'CUSTOM FEED SET-UP'!M9","v":0},{"$f":"'CUSTOM FEED SET-UP'!N9","v":0},{"$f":"'CUSTOM FEED SET-UP'!O9","v":"Dry"},{"$f":"'CUSTOM FEED SET-UP'!P9","v":0.5},{"$f":"'CUSTOM FEED SET-UP'!Q9","v":2.2400000000000002},{"$f":"'CUSTOM FEED SET-UP'!R9","v":0.3},{"$f":"'CUSTOM FEED SET-UP'!S9","v":0.11600000000000001},{"$f":"'CUSTOM FEED SET-UP'!T9","v":0.32800000000000001},{"$f":"'CUSTOM FEED SET-UP'!U9","v":0.47199999999999998},{"$f":"'CUSTOM FEED SET-UP'!V9","v":0.16400000000000001}]
[null,{"$f":"'CUSTOM FEED SET-UP'!B10","v":"Bulb 75% Leaf 25%"},{"$f":"'CUSTOM FEED SET-UP'!E10","v":11.75},{"$f":"'CUSTOM FEED SET-UP'!F10","v":11.6},{"$f":"'CUSTOM FEED SET-UP'!G10","v":11.45},{"$f":"'CUSTOM FEED SET-UP'!H10","v":16.55},{"$f":"'CUSTOM FEED SET-UP'!I10","v":52.375},{"$f":"'CUSTOM FEED SET-UP'!J10","v":3.75},{"$f":"'CUSTOM FEED SET-UP'!K10","v":0},{"$f":"'CUSTOM FEED SET-UP'!L10","v":0},{"$f":"'CUSTOM FEED SET-UP'!M10","v":0},{"$f":"'CUSTOM FEED SET-UP'!N10","v":0},{"$f":"'CUSTOM FEED SET-UP'!O10","v":"Dry"},{"$f":"'CUSTOM FEED SET-UP'!P10","v":0.55000000000000004},{"$f":"'CUSTOM FEED SET-UP'!Q10","v":2.2999999999999998},{"$f":"'CUSTOM FEED SET-UP'!R10","v":0.3},{"$f":"'CUSTOM FEED SET-UP'!S10","v":0.1275},{"$f":"'CUSTOM FEED SET-UP'!T10","v":0.37},{"$f":"'CUSTOM FEED SET-UP'!U10","v":0.55500000000000005},{"$f":"'CUSTOM FEED SET-UP'!V10","v":0.17249999999999999}]
[null,{"$f":"'CUSTOM FEED SET-UP'!B11","v":"Bulb 70% leaf 30%"},{"$f":"'CUSTOM FEED SET-UP'!E11","v":12.1},{"$f":"'CUSTOM FEED SET-UP'!F11","v":11.52},{"$f":"'CUSTOM FEED SET-UP'!G11","v":12.02},{"$f":"'CUSTOM FEED SET-UP'!H11","v":17.579999999999998},{"$f":"'CUSTOM FEED SET-UP'!I11","v":50.05},{"$f":"'CUSTOM FEED SET-UP'!J11","v":3.5},{"$f":"'CUSTOM FEED SET-UP'!K11","v":0},{"$f":"'CUSTOM FEED SET-UP'!L11","v":0},{"$f":"'CUSTOM FEED SET-UP'!M11","v":0},{"$f":"'CUSTOM FEED SET-UP'!N11","v":0},{"$f":"'CUSTOM FEED SET-UP'!O11","v":"Dry"},{"$f":"'CUSTOM FEED SET-UP'!P11","v":0.6},{"$f":"'CUSTOM FEED SET-UP'!Q11","v":2.36},{"$f":"'CUSTOM FEED SET-UP'!R11","v":0.3},{"$f":"'CUSTOM FEED SET-UP'!S11","v":0.13900000000000001},{"$f":"'CUSTOM FEED SET-UP'!T11","v":0.41200000000000003},{"$f":"'CUSTOM FEED SET-UP'!U11","v":0.63800000000000001},{"$f":"'CUSTOM FEED SET-UP'!V11","v":0.18099999999999999}]
[null,{"$f":"'CUSTOM FEED SET-UP'!B2","v":"Custom: Bulb% & Leaf%"},{"$f":"'CUSTOM FEED SET-UP'!E12","v":0},{"$f":"'CUSTOM FEED SET-UP'!F12","v":0},{"$f":"'CUSTOM FEED SET-UP'!G12","v":0},{"$f":"'CUSTOM FEED SET-UP'!H12","v":0},{"$f":"'CUSTOM FEED SET-UP'!I12","v":0},{"$f":"'CUSTOM FEED SET-UP'!J12","v":0},{"$f":"'CUSTOM FEED SET-UP'!K12","v":0},{"$f":"'CUSTOM FEED SET-UP'!L12","v":0},{"$f":"'CUSTOM FEED SET-UP'!M12","v":0},{"$f":"'CUSTOM FEED SET-UP'!N12","v":0},{"$f":"'CUSTOM FEED SET-UP'!O12","v":"Dry"},{"$f":"'CUSTOM FEED SET-UP'!P12","v":0},{"$f":"'CUSTOM FEED SET-UP'!Q12","v":0},{"$f":"'CUSTOM FEED SET-UP'!R12","v":0},{"$f":"'CUSTOM FEED SET-UP'!S12","v":0},{"$f":"'CUSTOM FEED SET-UP'!T12","v":0},{"$f":"'CUSTOM FEED SET-UP'!U12","v":0},{"$f":"'CUSTOM FEED SET-UP'!V12","v":0}]
[]
["Custom_Bulb_Crop_Measured",{"$f":"'CUSTOM FEED SET-UP'!B16","v":"Custom_Crops"}]
[null,{"$f":"'CUSTOM FEED SET-UP'!B17","v":" Bulb only"},{"$f":"'CUSTOM FEED SET-UP'!E17","v":0},{"$f":"'CUSTOM FEED SET-UP'!F17","v":0},{"$f":"'CUSTOM FEED SET-UP'!G17","v":0},{"$f":"'CUSTOM FEED SET-UP'!H17","v":0},{"$f":"'CUSTOM FEED SET-UP'!I17","v":0},{"$f":"'CUSTOM FEED SET-UP'!J17","v":0},{"$f":"'CUSTOM FEED SET-UP'!K17","v":0},{"$f":"'CUSTOM FEED SET-UP'!L17","v":0},{"$f":"'CUSTOM FEED SET-UP'!M17","v":0},{"$f":"'CUSTOM FEED SET-UP'!N17","v":0},{"$f":"'CUSTOM FEED SET-UP'!O17","v":0},{"$f":"'CUSTOM FEED SET-UP'!P17","v":0},{"$f":"'CUSTOM FEED SET-UP'!Q17","v":0},{"$f":"'CUSTOM FEED SET-UP'!R17","v":0},{"$f":"'CUSTOM FEED SET-UP'!S17","v":0},{"$f":"'CUSTOM FEED SET-UP'!T17","v":0},{"$f":"'CUSTOM FEED SET-UP'!U17","v":0},{"$f":"'CUSTOM FEED SET-UP'!V17","v":0}]
[null,{"$f":"'CUSTOM FEED SET-UP'!B18","v":" Leaf only"},{"$f":"'CUSTOM FEED SET-UP'!E18","v":0},{"$f":"'CUSTOM FEED SET-UP'!F18","v":0},{"$f":"'CUSTOM FEED SET-UP'!G18","v":0},{"$f":"'CUSTOM FEED SET-UP'!H18","v":0},{"$f":"'CUSTOM FEED SET-UP'!I18","v":0},{"$f":"'CUSTOM FEED SET-UP'!J18","v":0},{"$f":"'CUSTOM FEED SET-UP'!K18","v":0},{"$f":"'CUSTOM FEED SET-UP'!L18","v":0},{"$f":"'CUSTOM FEED SET-UP'!M18","v":0},{"$f":"'CUSTOM FEED SET-UP'!N18","v":0},{"$f":"'CUSTOM FEED SET-UP'!O18","v":0},{"$f":"'CUSTOM FEED SET-UP'!P18","v":0},{"$f":"'CUSTOM FEED SET-UP'!Q18","v":0},{"$f":"'CUSTOM FEED SET-UP'!R18","v":0},{"$f":"'CUSTOM FEED SET-UP'!S18","v":0},{"$f":"'CUSTOM FEED SET-UP'!T18","v":0},{"$f":"'CUSTOM FEED SET-UP'!U18","v":0},{"$f":"'CUSTOM FEED SET-UP'!V18","v":0}]
[null,{"$f":"'CUSTOM FEED SET-UP'!B19","v":" Bulb 90% Leaf 10%"},{"$f":"'CUSTOM FEED SET-UP'!E19","v":0},{"$f":"'CUSTOM FEED SET-UP'!F19","v":0},{"$f":"'CUSTOM FEED SET-UP'!G19","v":0},{"$f":"'CUSTOM FEED SET-UP'!H19","v":0},{"$f":"'CUSTOM FEED SET-UP'!I19","v":0},{"$f":"'CUSTOM FEED SET-UP'!J19","v":0},{"$f":"'CUSTOM FEED SET-UP'!K19","v":0},{"$f":"'CUSTOM FEED SET-UP'!L19","v":0},{"$f":"'CUSTOM FEED SET-UP'!M19","v":0},{"$f":"'CUSTOM FEED SET-UP'!N19","v":0},{"$f":"'CUSTOM FEED SET-UP'!O19","v":0},{"$f":"'CUSTOM FEED SET-UP'!P19","v":0},{"$f":"'CUSTOM FEED SET-UP'!Q19","v":0},{"$f":"'CUSTOM FEED SET-UP'!R19","v":0},{"$f":"'CUSTOM FEED SET-UP'!S19","v":0},{"$f":"'CUSTOM FEED SET-UP'!T19","v":0},{"$f":"'CUSTOM FEED SET-UP'!U19","v":0},{"$f":"'CUSTOM FEED SET-UP'!V19","v":0}]
[null,{"$f":"'CUSTOM FEED SET-UP'!B20","v":" Bulb 85% Leaf 15%"},{"$f":"'CUSTOM FEED SET-UP'!E20","v":0},{"$f":"'CUSTOM FEED SET-UP'!F20","v":0},{"$f":"'CUSTOM FEED SET-UP'!G20","v":0},{"$f":"'CUSTOM FEED SET-UP'!H20","v":0},{"$f":"'CUSTOM FEED SET-UP'!I20","v":0},{"$f":"'CUSTOM FEED SET-UP'!J20","v":0},{"$f":"'CUSTOM FEED SET-UP'!K20","v":0},{"$f":"'CUSTOM FEED SET-UP'!L20","v":0},{"$f":"'CUSTOM FEED SET-UP'!M20","v":0},{"$f":"'CUSTOM FEED SET-UP'!N20","v":0},{"$f":"'CUSTOM FEED SET-UP'!O20","v":0},{"$f":"'CUSTOM FEED SET-UP'!P20","v":0},{"$f":"'CUSTOM FEED SET-UP'!Q20","v":0},{"$f":"'CUSTOM FEED SET-UP'!R20","v":0},{"$f":"'CUSTOM FEED SET-UP'!S20","v":0},{"$f":"'CUSTOM FEED SET-UP'!T20","v":0},{"$f":"'CUSTOM FEED SET-UP'!U20","v":0},{"$f":"'CUSTOM FEED SET-UP'!V20","v":0}]
[null,{"$f":"'CUSTOM FEED SET-UP'!B21","v":" Bulb 80% Leaf 20%"},{"$f":"'CUSTOM FEED SET-UP'!E21","v":0},{"$f":"'CUSTOM FEED SET-UP'!F21","v":0},{"$f":"'CUSTOM FEED SET-UP'!G21","v":0},{"$f":"'CUSTOM FEED SET-UP'!H21","v":0},{"$f":"'CUSTOM FEED SET-UP'!I21","v":0},{"$f":"'CUSTOM FEED SET-UP'!J21","v":0},{"$f":"'CUSTOM FEED SET-UP'!K21","v":0},{"$f":"'CUSTOM FEED SET-UP'!L21","v":0},{"$f":"'CUSTOM FEED SET-UP'!M21","v":0},{"$f":"'CUSTOM FEED SET-UP'!N21","v":0},{"$f":"'CUSTOM FEED SET-UP'!O21","v":0},{"$f":"'CUSTOM FEED SET-UP'!P21","v":0},{"$f":"'CUSTOM FEED SET-UP'!Q21","v":0},{"$f":"'CUSTOM FEED SET-UP'!R21","v":0},{"$f":"'CUSTOM FEED SET-UP'!S21","v":0},{"$f":"'CUSTOM FEED SET-UP'!T21","v":0},{"$f":"'CUSTOM FEED SET-UP'!U21","v":0},{"$f":"'CUSTOM FEED SET-UP'!V21","v":0}]
[null,{"$f":"'CUSTOM FEED SET-UP'!B22","v":" Bulb 75% Leaf 25%"},{"$f":"'CUSTOM FEED SET-UP'!E22","v":0},{"$f":"'CUSTOM FEED SET-UP'!F22","v":0},{"$f":"'CUSTOM FEED SET-UP'!G22","v":0},{"$f":"'CUSTOM FEED SET-UP'!H22","v":0},{"$f":"'CUSTOM FEED SET-UP'!I22","v":0},{"$f":"'CUSTOM FEED SET-UP'!J22","v":0},{"$f":"'CUSTOM FEED SET-UP'!K22","v":0},{"$f":"'CUSTOM FEED SET-UP'!L22","v":0},{"$f":"'CUSTOM FEED SET-UP'!M22","v":0},{"$f":"'CUSTOM FEED SET-UP'!N22","v":0},{"$f":"'CUSTOM FEED SET-UP'!O22","v":0},{"$f":"'CUSTOM FEED SET-UP'!P22","v":0},{"$f":"'CUSTOM FEED SET-UP'!Q22","v":0},{"$f":"'CUSTOM FEED SET-UP'!R22","v":0},{"$f":"'CUSTOM FEED SET-UP'!S22","v":0},{"$f":"'CUSTOM FEED SET-UP'!T22","v":0},{"$f":"'CUSTOM FEED SET-UP'!U22","v":0},{"$f":"'CUSTOM FEED SET-UP'!V22","v":0}]
[null,{"$f":"'CUSTOM FEED SET-UP'!B23","v":" Bulb 70% leaf 30%"},{"$f":"'CUSTOM FEED SET-UP'!E23","v":0},{"$f":"'CUSTOM FEED SET-UP'!F23","v":0},{"$f":"'CUSTOM FEED SET-UP'!G23","v":0},{"$f":"'CUSTOM FEED SET-UP'!H23","v":0},{"$f":"'CUSTOM FEED SET-UP'!I23","v":0},{"$f":"'CUSTOM FEED SET-UP'!J23","v":0},{"$f":"'CUSTOM FEED SET-UP'!K23","v":0},{"$f":"'CUSTOM FEED SET-UP'!L23","v":0},{"$f":"'CUSTOM FEED SET-UP'!M23","v":0},{"$f":"'CUSTOM FEED SET-UP'!N23","v":0},{"$f":"'CUSTOM FEED SET-UP'!O23","v":0},{"$f":"'CUSTOM FEED SET-UP'!P23","v":0},{"$f":"'CUSTOM FEED SET-UP'!Q23","v":0},{"$f":"'CUSTOM FEED SET-UP'!R23","v":0},{"$f":"'CUSTOM FEED SET-UP'!S23","v":0},{"$f":"'CUSTOM FEED SET-UP'!T23","v":0},{"$f":"'CUSTOM FEED SET-UP'!U23","v":0},{"$f":"'CUSTOM FEED SET-UP'!V23","v":0}]
[null,{"$f":"'CUSTOM FEED SET-UP'!B24","v":" Custom: Bulb% & Leaf%"},{"$f":"'CUSTOM FEED SET-UP'!E24","v":0},{"$f":"'CUSTOM FEED SET-UP'!F24","v":0},{"$f":"'CUSTOM FEED SET-UP'!G24","v":0},{"$f":"'CUSTOM FEED SET-UP'!H24","v":0},{"$f":"'CUSTOM FEED SET-UP'!I24","v":0},{"$f":"'CUSTOM FEED SET-UP'!J24","v":0},{"$f":"'CUSTOM FEED SET-UP'!K24","v":0},{"$f":"'CUSTOM FEED SET-UP'!L24","v":0},{"$f":"'CUSTOM FEED SET-UP'!M24","v":0},{"$f":"'CUSTOM FEED SET-UP'!N24","v":0},{"$f":"'CUSTOM FEED SET-UP'!O24","v":0},{"$f":"'CUSTOM FEED SET-UP'!P24","v":0},{"$f":"'CUSTOM FEED SET-UP'!Q24","v":0},{"$f":"'CUSTOM FEED SET-UP'!R24","v":0},{"$f":"'CUSTOM FEED SET-UP'!S24","v":0},{"$f":"'CUSTOM FEED SET-UP'!T24","v":0},{"$f":"'CUSTOM FEED SET-UP'!U24","v":0},{"$f":"'CUSTOM FEED SET-UP'!V24","v":0}]
[]
[]
["Custom_feed",{"$f":"'CUSTOM FEED SET-UP'!B34","v":"Custom feed 1"},{"$f":"'CUSTOM FEED SET-UP'!E34","v":0},{"$f":"'CUSTOM FEED SET-UP'!F34","v":0},{"$f":"'CUSTOM FEED SET-UP'!G34","v":0},{"$f":"'CUSTOM FEED SET-UP'!H34","v":0},{"$f":"'CUSTOM FEED SET-UP'!I34","v":0},{"$f":"'CUSTOM FEED SET-UP'!J34","v":0},{"$f":"'CUSTOM FEED SET-UP'!K34","v":0},{"$f":"'CUSTOM FEED SET-UP'!L34","v":0},{"$f":"'CUSTOM FEED SET-UP'!M34","v":0},{"$f":"'CUSTOM FEED SET-UP'!N34","v":0},{"$f":"'CUSTOM FEED SET-UP'!O34","v":0},{"$f":"'CUSTOM FEED SET-UP'!P34","v":0},{"$f":"'CUSTOM FEED SET-UP'!Q34","v":0},{"$f":"'CUSTOM FEED SET-UP'!R34","v":0},{"$f":"'CUSTOM FEED SET-UP'!S34","v":0},{"$f":"'CUSTOM FEED SET-UP'!T34","v":0},{"$f":"'CUSTOM FEED SET-UP'!U34","v":0},{"$f":"'CUSTOM FEED SET-UP'!V34","v":0}]
[null,{"$f":"'CUSTOM FEED SET-UP'!B35","v":"Custom feed 2"},{"$f":"'CUSTOM FEED SET-UP'!E35","v":0},{"$f":"'CUSTOM FEED SET-UP'!F35","v":0},{"$f":"'CUSTOM FEED SET-UP'!G35","v":0},{"$f":"'CUSTOM FEED SET-UP'!H35","v":0},{"$f":"'CUSTOM FEED SET-UP'!I35","v":0},{"$f":"'CUSTOM FEED SET-UP'!J35","v":0},{"$f":"'CUSTOM FEED SET-UP'!K35","v":0},{"$f":"'CUSTOM FEED SET-UP'!L35","v":0},{"$f":"'CUSTOM FEED SET-UP'!M35","v":0},{"$f":"'CUSTOM FEED SET-UP'!N35","v":0},{"$f":"'CUSTOM FEED SET-UP'!O35","v":0},{"$f":"'CUSTOM FEED SET-UP'!P35","v":0},{"$f":"'CUSTOM FEED SET-UP'!Q35","v":0},{"$f":"'CUSTOM FEED SET-UP'!R35","v":0},{"$f":"'CUSTOM FEED SET-UP'!S35","v":0},{"$f":"'CUSTOM FEED SET-UP'!T35","v":0},{"$f":"'CUSTOM FEED SET-UP'!U35","v":0},{"$f":"'CUSTOM FEED SET-UP'!V35","v":0}]
[null,{"$f":"'CUSTOM FEED SET-UP'!B36","v":"Custom feed 3"},{"$f":"'CUSTOM FEED SET-UP'!E36","v":0},{"$f":"'CUSTOM FEED SET-UP'!F36","v":0},{"$f":"'CUSTOM FEED SET-UP'!G36","v":0},{"$f":"'CUSTOM FEED SET-UP'!H36","v":0},{"$f":"'CUSTOM FEED SET-UP'!I36","v":0},{"$f":"'CUSTOM FEED SET-UP'!J36","v":0},{"$f":"'CUSTOM FEED SET-UP'!K36","v":0},{"$f":"'CUSTOM FEED SET-UP'!L36","v":0},{"$f":"'CUSTOM FEED SET-UP'!M36","v":0},{"$f":"'CUSTOM FEED SET-UP'!N36","v":0},{"$f":"'CUSTOM FEED SET-UP'!O36","v":0},{"$f":"'CUSTOM FEED SET-UP'!P36","v":0},{"$f":"'CUSTOM FEED SET-UP'!Q36","v":0},{"$f":"'CUSTOM FEED SET-UP'!R36","v":0},{"$f":"'CUSTOM FEED SET-UP'!S36","v":0},{"$f":"'CUSTOM FEED SET-UP'!T36","v":0},{"$f":"'CUSTOM FEED SET-UP'!U36","v":0},{"$f":"'CUSTOM FEED SET-UP'!V36","v":0}]
[null,{"$f":"'CUSTOM FEED SET-UP'!B37","v":"Custom feed 4"},{"$f":"'CUSTOM FEED SET-UP'!E37","v":0},{"$f":"'CUSTOM FEED SET-UP'!F37","v":0},{"$f":"'CUSTOM FEED SET-UP'!G37","v":0},{"$f":"'CUSTOM FEED SET-UP'!H37","v":0},{"$f":"'CUSTOM FEED SET-UP'!I37","v":0},{"$f":"'CUSTOM FEED SET-UP'!J37","v":0},{"$f":"'CUSTOM FEED SET-UP'!K37","v":0},{"$f":"'CUSTOM FEED SET-UP'!L37","v":0},{"$f":"'CUSTOM FEED SET-UP'!M37","v":0},{"$f":"'CUSTOM FEED SET-UP'!N37","v":0},{"$f":"'CUSTOM FEED SET-UP'!O37","v":0},{"$f":"'CUSTOM FEED SET-UP'!P37","v":0},{"$f":"'CUSTOM FEED SET-UP'!Q37","v":0},{"$f":"'CUSTOM FEED SET-UP'!R37","v":0},{"$f":"'CUSTOM FEED SET-UP'!S37","v":0},{"$f":"'CUSTOM FEED SET-UP'!T37","v":0},{"$f":"'CUSTOM FEED SET-UP'!U37","v":0},{"$f":"'CUSTOM FEED SET-UP'!V37","v":0}]
[null,{"$f":"'CUSTOM FEED SET-UP'!B38","v":"Custom feed 5"},{"$f":"'CUSTOM FEED SET-UP'!E38","v":0},{"$f":"'CUSTOM FEED SET-UP'!F38","v":0},{"$f":"'CUSTOM FEED SET-UP'!G38","v":0},{"$f":"'CUSTOM FEED SET-UP'!H38","v":0},{"$f":"'CUSTOM FEED SET-UP'!I38","v":0},{"$f":"'CUSTOM FEED SET-UP'!J38","v":0},{"$f":"'CUSTOM FEED SET-UP'!K38","v":0},{"$f":"'CUSTOM FEED SET-UP'!L38","v":0},{"$f":"'CUSTOM FEED SET-UP'!M38","v":0},{"$f":"'CUSTOM FEED SET-UP'!N38","v":0},{"$f":"'CUSTOM FEED SET-UP'!O38","v":0},{"$f":"'CUSTOM FEED SET-UP'!P38","v":0},{"$f":"'CUSTOM FEED SET-UP'!Q38","v":0},{"$f":"'CUSTOM FEED SET-UP'!R38","v":0},{"$f":"'CUSTOM FEED SET-UP'!S38","v":0},{"$f":"'CUSTOM FEED SET-UP'!T38","v":0},{"$f":"'CUSTOM FEED SET-UP'!U38","v":0},{"$f":"'CUSTOM FEED SET-UP'!V38","v":0}]
[null,{"$f":"'CUSTOM FEED SET-UP'!B39","v":"Custom feed 6"},{"$f":"'CUSTOM FEED SET-UP'!E39","v":0},{"$f":"'CUSTOM FEED SET-UP'!F39","v":0},{"$f":"'CUSTOM FEED SET-UP'!G39","v":0},{"$f":"'CUSTOM FEED SET-UP'!H39","v":0},{"$f":"'CUSTOM FEED SET-UP'!I39","v":0},{"$f":"'CUSTOM FEED SET-UP'!J39","v":0},{"$f":"'CUSTOM FEED SET-UP'!K39","v":0},{"$f":"'CUSTOM FEED SET-UP'!L39","v":0},{"$f":"'CUSTOM FEED SET-UP'!M39","v":0},{"$f":"'CUSTOM FEED SET-UP'!N39","v":0},{"$f":"'CUSTOM FEED SET-UP'!O39","v":0},{"$f":"'CUSTOM FEED SET-UP'!P39","v":0},{"$f":"'CUSTOM FEED SET-UP'!Q39","v":0},{"$f":"'CUSTOM FEED SET-UP'!R39","v":0},{"$f":"'CUSTOM FEED SET-UP'!S39","v":0},{"$f":"'CUSTOM FEED SET-UP'!T39","v":0},{"$f":"'CUSTOM FEED SET-UP'!U39","v":0},{"$f":"'CUSTOM FEED SET-UP'!V39","v":0}]
[null,{"$f":"'CUSTOM FEED SET-UP'!B40","v":"Custom feed 7"},{"$f":"'CUSTOM FEED SET-UP'!E40","v":0},{"$f":"'CUSTOM FEED SET-UP'!F40","v":0},{"$f":"'CUSTOM FEED SET-UP'!G40","v":0},{"$f":"'CUSTOM FEED SET-UP'!H40","v":0},{"$f":"'CUSTOM FEED SET-UP'!I40","v":0},{"$f":"'CUSTOM FEED SET-UP'!J40","v":0},{"$f":"'CUSTOM FEED SET-UP'!K40","v":0},{"$f":"'CUSTOM FEED SET-UP'!L40","v":0},{"$f":"'CUSTOM FEED SET-UP'!M40","v":0},{"$f":"'CUSTOM FEED SET-UP'!N40","v":0},{"$f":"'CUSTOM FEED SET-UP'!O40","v":0},{"$f":"'CUSTOM FEED SET-UP'!P40","v":0},{"$f":"'CUSTOM FEED SET-UP'!Q40","v":0},{"$f":"'CUSTOM FEED SET-UP'!R40","v":0},{"$f":"'CUSTOM FEED SET-UP'!S40","v":0},{"$f":"'CUSTOM FEED SET-UP'!T40","v":0},{"$f":"'CUSTOM FEED SET-UP'!U40","v":0},{"$f":"'CUSTOM FEED SET-UP'!V40","v":0}]
[null,{"$f":"'CUSTOM FEED SET-UP'!B41","v":"Custom feed 8"},{"$f":"'CUSTOM FEED SET-UP'!E41","v":0},{"$f":"'CUSTOM FEED SET-UP'!F41","v":0},{"$f":"'CUSTOM FEED SET-UP'!G41","v":0},{"$f":"'CUSTOM FEED SET-UP'!H41","v":0},{"$f":"'CUSTOM FEED SET-UP'!I41","v":0},{"$f":"'CUSTOM FEED SET-UP'!J41","v":0},{"$f":"'CUSTOM FEED SET-UP'!K41","v":0},{"$f":"'CUSTOM FEED SET-UP'!L41","v":0},{"$f":"'CUSTOM FEED SET-UP'!M41","v":0},{"$f":"'CUSTOM FEED SET-UP'!N41","v":0},{"$f":"'CUSTOM FEED SET-UP'!O41","v":0},{"$f":"'CUSTOM FEED SET-UP'!P41","v":0},{"$f":"'CUSTOM FEED SET-UP'!Q41","v":0},{"$f":"'CUSTOM FEED SET-UP'!R41","v":0},{"$f":"'CUSTOM FEED SET-UP'!S41","v":0},{"$f":"'CUSTOM FEED SET-UP'!T41","v":0},{"$f":"'CUSTOM FEED SET-UP'!U41","v":0},{"$f":"'CUSTOM FEED SET-UP'!V41","v":0}]
[null,{"$f":"'CUSTOM FEED SET-UP'!B42","v":"Custom feed 9"},{"$f":"'CUSTOM FEED SET-UP'!E42","v":0},{"$f":"'CUSTOM FEED SET-UP'!F42","v":0},{"$f":"'CUSTOM FEED SET-UP'!G42","v":0},{"$f":"'CUSTOM FEED SET-UP'!H42","v":0},{"$f":"'CUSTOM FEED SET-UP'!I42","v":0},{"$f":"'CUSTOM FEED SET-UP'!J42","v":0},{"$f":"'CUSTOM FEED SET-UP'!K42","v":0},{"$f":"'CUSTOM FEED SET-UP'!L42","v":0},{"$f":"'CUSTOM FEED SET-UP'!M42","v":0},{"$f":"'CUSTOM FEED SET-UP'!N42","v":0},{"$f":"'CUSTOM FEED SET-UP'!O42","v":0},{"$f":"'CUSTOM FEED SET-UP'!P42","v":0},{"$f":"'CUSTOM FEED SET-UP'!Q42","v":0},{"$f":"'CUSTOM FEED SET-UP'!R42","v":0},{"$f":"'CUSTOM FEED SET-UP'!S42","v":0},{"$f":"'CUSTOM FEED SET-UP'!T42","v":0},{"$f":"'CUSTOM FEED SET-UP'!U42","v":0},{"$f":"'CUSTOM FEED SET-UP'!V42","v":0}]
[null,{"$f":"'CUSTOM FEED SET-UP'!B43","v":"Custom feed 10"},{"$f":"'CUSTOM FEED SET-UP'!E43","v":0},{"$f":"'CUSTOM FEED SET-UP'!F43","v":0},{"$f":"'CUSTOM FEED SET-UP'!G43","v":0},{"$f":"'CUSTOM FEED SET-UP'!H43","v":0},{"$f":"'CUSTOM FEED SET-UP'!I43","v":0},{"$f":"'CUSTOM FEED SET-UP'!J43","v":0},{"$f":"'CUSTOM FEED SET-UP'!K43","v":0},{"$f":"'CUSTOM FEED SET-UP'!L43","v":0},{"$f":"'CUSTOM FEED SET-UP'!M43","v":0},{"$f":"'CUSTOM FEED SET-UP'!N43","v":0},{"$f":"'CUSTOM FEED SET-UP'!O43","v":0},{"$f":"'CUSTOM FEED SET-UP'!P43","v":0},{"$f":"'CUSTOM FEED SET-UP'!Q43","v":0},{"$f":"'CUSTOM FEED SET-UP'!R43","v":0},{"$f":"'CUSTOM FEED SET-UP'!S43","v":0},{"$f":"'CUSTOM FEED SET-UP'!T43","v":0},{"$f":"'CUSTOM FEED SET-UP'!U43","v":0},{"$f":"'CUSTOM FEED SET-UP'!V43","v":0}]
[]
[]
["Minerals"]
[null,"MgSO4 ",null,null,null,null,null,null,null,null,null,null,"Dry",null,null,null,13,10]
[null,"MgCl2 ",null,null,null,null,null,null,null,null,null,null,"Dry",null,null,35,null,12]
[null,"MgO ",null,null,null,null,null,null,null,null,null,null,"Dry",null,null,null,null,55]
[null,"Gypsum ",null,null,null,null,null,null,null,null,null,null,"Dry",null,null,null,23,null,30]
[null,"limeflour ",null,null,null,null,null,null,null,null,null,null,"Dry",null,null,null,null,null,41]
[null,"DCP ",null,null,null,null,null,null,null,null,null,null,"Dry",null,null,null,null,null,24,18]
[null,"MSP",null,null,null,null,null,null,null,null,null,null,"Dry",31,null,null,null,null,null,26]
[null,"NaCl",null,null,null,null,null,null,null,null,null,null,"Dry",39,null,61]
[null,"MCP",null,null,null,null,null,null,null,null,null,null,"Dry",null,null,null,null,1,16.5,22.7]
[null,"MGP",null,null,null,null,null,null,null,null,null,null,"Dry",null,null,null,null,25.5,1,14.5]
[]
[]
[]
[]
[]
[]
[]
[]
[]
[]
[]
[]
[]
[]
["FEED METHOD UTILISATION","PASTURE"]
[null,"grazing - very good conditions",0.95]
[null,"grazing - good conditions",0.9]
[null,"grazing - wet conditions",0.8]
[null,"grazing - very poor conditions",0.7]
[null,""]
[null,""]
[null,"HAY_SILAGE"]
[null,"feed pad",0.9]
[null,"in paddock good conditions",0.8]
[null,"in paddock poor conditions",0.6]
[null,"in a bale feeder",0.8,"check"]
[null,""]
[null,"CONCENTRATE"]
[null,"in-shed",0.95]
[null,"feed pad",0.9]
[null,"in trailer",0.85]
[null,""]
[null,""]
[null,"FORAGES"]
[null,"grazing - very good conditions",0.95]
[null,"grazing - good conditions",0.9]
[null,"grazing - wet conditions",0.8]
[null,"grazing - very poor conditions",0.7]
[null,""]
[null,""]
[null,"BY_PRODUCTS"]
[null,"in-shed",0.95]
[null,"feed pad",0.9]
[null,"in trailer",0.85]
[null,"in paddock good conditions",0.8]
[null,"in paddock wet conditions",0.6]
[null," "]
[null," "]
[null,"MINERALS"]
[null,"in-shed",0.95]
[null,"feed pad",0.9]
[null,"in trailer",0.85]
[null,"dusted - good conditions",0.5]
[null,"dusted - wet conditions",0.33]
[null,"in water",1]
[null,"in slurry",0.8]
[null,"loose lick",1]
[null," "]
[null," "]
[null,"CUSTOM FEEDS"]
[null,"in-shed",0.95]
[null,"feed pad",0.9]
[null,"in trailer",0.85]
[null,"in paddock good conditions",0.8]
[null,"in paddock wet conditions",0.6]
[null,"grazing - very good conditions",0.95]
[null,"grazing - good conditions",0.9]
[null,"grazing - wet conditions",0.8]
[null,"grazing - very poor conditions",0.7]
[null,""]
[null,""]
[null,"BULB CROPS"]
[null,"Utilisation 95%",0.95]
[null,"Utilisation 90%",0.9]
[null,"Utilisation 85%",0.85]
[null,"Utilisation 80%",0.8]
[null,"Utilisation 75%",0.75]
[null,"Utilisation 70%",0.7]
[null,"Utilisation 65%",0.65]
[null,"Utilisation 60%",0.6]
[null,"Utilisation 55%",0.55000000000000004]
[null,""]
[null,""]
["LWT",null,"ME for maintenance as of F&F mar 17",null,12,8,4,2]
[null,375,48,0,11.75,20,33.200000000000003,43.099999999999994]
[null,400,50,0,10.5,19.299999999999997,33.599999999999994,43.5]
[null,425,{"$f":"((C193-C191)/2)+C191","v":52},0,11.25,19.5,34.900000000000006,45.900000000000006]
[null,450,54,0,12,20.799999999999997,37.300000000000011,48.300000000000011]
[null,475,{"$f":"((C195-C193)/2)+C193","v":56.5},0,11.75,21.099999999999994,38.699999999999989,49.699999999999989]
[null,500,59,0,12.5,22.400000000000006,40,52.099999999999994]
[null,525,{"$f":"((C197-C195)/2)+C195","v":61},0,13.25,23.700000000000003,41.300000000000011,53.400000000000006]
[null,550,63,0,14,25,42.599999999999994,55.800000000000011]
[null,575,{"$f":"((C199-C197)/2)+C197","v":65.5},0,14.75,26.300000000000011,43.900000000000006,58.199999999999989]
[null,600,68,0,14.5,26.599999999999994,21.099999999999994,59.599999999999994]
[]
[]
["BREED",null,"ME for milksolids"]
["Jersey","Jersey",77]
["Friesian","Friesian",82]
["cross-bred","cross-bred",80]
[]
[]
["TERRAIN for activity"]
[null,"flat",2]
[null,"rolling",3]
[null,"hilly",6]
[null,null,null,null,null,null,null,"Values in eqns"]
["WEEKS TO CALVING",null,null,"All",">12",null,null,0]
[null,"12 weeks before calving",null,"j",12,null,"J12",10]
[null,"8 weeks before calving",null,"j",8,null,"J8",17]
[null,"4 weeks before calving",null,"j",4,null,"J4",30]
[null,"2 weeks before calving",null,"j",2,null,"J2",40]
[null,"12 weeks before calving",null,"x",12,null,"X12",11]
[null,"8 weeks before calving",null,"x",8,null,"X8",20]
[null,"4 weeks before calving",null,"x",4,null,"X4",35]
[null,"2 weeks before calving",null,"x",2,null,"X2",45]
[null,"12 weeks before calving",null,"f",12,null,"F12",12]
[null,"8 weeks before calving",null,"f",8,null,"F8",22]
[null,"4 weeks before calving",null,"f",4,null,"F4",39]
[null,"2 weeks before calving",null,"f",2,null,"F2",51]
[]
["BCS - Herd avg"]
[null,3]
[null,3.5]
[null,4]
[null,4.5]
[null,5]
[null,5.5]
[null,6]
[null,6.5]
[null,7]
[]
["BCS gain/loss mthly"]
[null,-0.8]
[null,-0.6]
[null,-0.4]
[null,-0.2]
[null,-0.1]
[null,0]
[null,0.1]
[null,0.2]
[null,0.4]
[null,0.6]
[]
["CRUDE PROTEIN","Stage of lactation","CP%"]
[null,"Early",18]
[null,"Mid",16]
[null,"Late",14]
[null,"Dry",12]
[]
[]
["YES/NO","NO"]
[null,"YES"]
[]
[null,null,"mg"]
[null,"Early",0.4]
[null,"Mid",0.3]
[null,"Late",0.2]
[null,"Dry",0.4]

{"sheet":"Drop down list set up","index":12,"n_rows":29,"n_cols":11,"rows_kept":29,"cut":false,"hidden":true,"merged":[[1,3,1,7]]}
["Dependent drop-down lists"]
[null,null,null,"Add new feeds in the Data Source sheet - Coloured cells indicate spare spaces available in each section"]
["Named ranges",null,"Feeds"]
["Feed_Type","Code","Pasture","Hay_Silage","Concentrates","By_products","Fodder_beet_Default","Other_Crops_Default","Minerals","Custom_Feeds_Minerals","Custom_Bulb_Crops"]
[null,null,{"$f":"'Data source'!B4","v":"Autumn and winter"},{"$f":"'Data source'!B16","v":"Hay - pasture - good"},{"$f":"'Data source'!B29","v":"Barley"},{"$f":"'Data source'!B53","v":"Apple pomace"},{"$f":"'CUSTOM FEED SET-UP'!B5","v":"Bulb only"},{"$f":"'Data source'!B41","v":"Chicory"},{"$f":"'Data source'!B100","v":"limeflour "},{"$f":"'CUSTOM FEED SET-UP'!B34","v":"Custom feed 1"},{"$f":"'CUSTOM FEED SET-UP'!B17","v":" Bulb only"}]
["Hay_Silage","FT1",{"$f":"'Data source'!B5","v":"Autumn & winter -Irrigated"},{"$f":"'Data source'!B17","v":"Hay - pasture - poor"},{"$f":"'Data source'!B30","v":"Bran (wheat)"},{"$f":"'Data source'!B54","v":"Brewers grain"},{"$f":"'CUSTOM FEED SET-UP'!B7","v":"Bulb 90% Leaf 10%"},{"$f":"'Data source'!B42","v":"Kale"},{"$f":"'Data source'!B99","v":"Gypsum "},{"$f":"'CUSTOM FEED SET-UP'!B35","v":"Custom feed 2"},{"$f":"'CUSTOM FEED SET-UP'!B19","v":" Bulb 90% Leaf 10%"}]
["Concentrates","FT2",{"$f":"'Data source'!B6","v":"Spring"},{"$f":"'Data source'!B18","v":"Straw - cereal"},{"$f":"'Data source'!B31","v":"Canola meal"},{"$f":"'Data source'!B55","v":"Broll"},{"$f":"'CUSTOM FEED SET-UP'!B8","v":"Bulb 85% Leaf 15%"},{"$f":"'Data source'!B43","v":"Lucerne"},{"$f":"'Data source'!B101","v":"DCP "},{"$f":"'CUSTOM FEED SET-UP'!B36","v":"Custom feed 3"},{"$f":"'CUSTOM FEED SET-UP'!B20","v":" Bulb 85% Leaf 15%"}]
["By_products","FT3",{"$f":"'Data source'!B7","v":"Spring - Irrigated"},{"$f":"'Data source'!B19","v":"Silage -pasture - good"},{"$f":"'Data source'!B32","v":"Maize grain"},{"$f":"'Data source'!B56","v":"DDG (Dried distillers grain)"},{"$f":"'CUSTOM FEED SET-UP'!B9","v":"Bulb 80% Leaf 20%"},{"$f":"'Data source'!B44","v":"Swedes"},{"$f":"'Data source'!B97","v":"MgCl2 "},{"$f":"'CUSTOM FEED SET-UP'!B37","v":"Custom feed 4"},{"$f":"'CUSTOM FEED SET-UP'!B21","v":" Bulb 80% Leaf 20%"}]
["Fodder_beet_Default","FT4",{"$f":"'Data source'!B8","v":"Summer - leafy"},{"$f":"'Data source'!B20","v":"Silage - pasture - poor"},{"$f":"'Data source'!B33","v":"Oats"},{"$f":"'Data source'!B57","v":"Molasses"},{"$f":"'CUSTOM FEED SET-UP'!B10","v":"Bulb 75% Leaf 25%"},{"$f":"'Data source'!B45","v":"Turnips"},{"$f":"'Data source'!B98","v":"MgO "},{"$f":"'CUSTOM FEED SET-UP'!B38","v":"Custom feed 5"},{"$f":"'CUSTOM FEED SET-UP'!B22","v":" Bulb 75% Leaf 25%"}]
["Other_Crops_Default","FT5",{"$f":"'Data source'!B9","v":"Summer - leafy - irrigated"},{"$f":"'Data source'!B21","v":"Silage - maize - good"},{"$f":"'Data source'!B34","v":"Soyabean hulls"},{"$f":"'Data source'!B52","v":"PKE"},{"$f":"'CUSTOM FEED SET-UP'!B11","v":"Bulb 70% leaf 30%"},null,{"$f":"'Data source'!B96","v":"MgSO4 "},{"$f":"'CUSTOM FEED SET-UP'!B39","v":"Custom feed 6"},{"$f":"'CUSTOM FEED SET-UP'!B23","v":" Bulb 70% leaf 30%"}]
["Minerals","FT6",{"$f":"'Data source'!B10","v":"Summer - stalky"},{"$f":"'Data source'!B22","v":"Silage - maize - poor"},{"$f":"'Data source'!B35","v":"Soyabean meal"},{"$f":"'Data source'!B58","v":"Potatoes"},{"$f":"'CUSTOM FEED SET-UP'!B2","v":"Custom: Bulb% & Leaf%"},null,{"$f":"'Data source'!B102","v":"MSP"},{"$f":"'CUSTOM FEED SET-UP'!B40","v":"Custom feed 7"},{"$f":"'CUSTOM FEED SET-UP'!B24","v":" Custom: Bulb% & Leaf%"}]
["Custom_Feeds_Minerals","FT7",{"$f":"'Data source'!B11","v":"Kikuyu - leafy"},{"$f":"'Data source'!B23","v":"Silage -whole crop"},{"$f":"'Data source'!B36","v":"Tapioca"},{"$f":"'Data source'!B59","v":"Urea"},null,null,{"$f":"'Data source'!B104","v":"MCP"},{"$f":"'CUSTOM FEED SET-UP'!B41","v":"Custom feed 8"}]
["Custom_Bulb_Crops","FT8",{"$f":"'Data source'!B12","v":"Kikuyu - stemmy"},{"$f":"'Data source'!B24","v":"Silage -lucerne"},{"$f":"'Data source'!B37","v":"Wheat"},{"$f":"'Data source'!B60","v":""},null,null,{"$f":"'Data source'!B105","v":"MGP"},{"$f":"'CUSTOM FEED SET-UP'!B42","v":"Custom feed 9"}]
[null,null,{"$f":"'Data source'!B13","v":""},{"$f":"'Data source'!B25","v":"Silage - cereal"},{"$f":"'Data source'!B38","v":""},{"$f":"'Data source'!B61","v":""},null,null,null,{"$f":"'CUSTOM FEED SET-UP'!B43","v":"Custom feed 10"}]
[null,null,{"$f":"'Data source'!B14","v":""},{"$f":"'Data source'!B26","v":"Baleage"},{"$f":"'Data source'!B39","v":""}]
[null,null,null,{"$f":"'Data source'!B27","v":""}]
[null,null,"Feeding Methods",null,"These are also dragged through from the Data Source sheet"]
["Drop-down for methods",null,null,"FT1_","FT2_","FT3_","FT4_","FT5_","FT6_","FT7_","FT8_"]
["FT1",null,{"$f":"'Data source'!B121","v":"grazing - very good conditions"},{"$f":"'Data source'!B128","v":"feed pad"},{"$f":"'Data source'!B134","v":"in-shed"},{"$f":"'Data source'!B147","v":"in-shed"},{"$f":"'Data source'!B178","v":"Utilisation 95%"},{"$f":"'Data source'!B178","v":"Utilisation 95%"},{"$f":"'Data source'!B155","v":"in-shed"},{"$f":"'Data source'!B166","v":"in-shed"},{"$f":"'Data source'!B178","v":"Utilisation 95%"}]
["FT2",null,{"$f":"'Data source'!B122","v":"grazing - good conditions"},{"$f":"'Data source'!B129","v":"in paddock good conditions"},{"$f":"'Data source'!B135","v":"feed pad"},{"$f":"'Data source'!B148","v":"feed pad"},{"$f":"'Data source'!B179","v":"Utilisation 90%"},{"$f":"'Data source'!B179","v":"Utilisation 90%"},{"$f":"'Data source'!B156","v":"feed pad"},{"$f":"'Data source'!B167","v":"feed pad"},{"$f":"'Data source'!B179","v":"Utilisation 90%"}]
["FT3",null,{"$f":"'Data source'!B123","v":"grazing - wet conditions"},{"$f":"'Data source'!B130","v":"in paddock poor conditions"},{"$f":"'Data source'!B136","v":"in trailer"},{"$f":"'Data source'!B149","v":"in trailer"},{"$f":"'Data source'!B180","v":"Utilisation 85%"},{"$f":"'Data source'!B180","v":"Utilisation 85%"},{"$f":"'Data source'!B157","v":"in trailer"},{"$f":"'Data source'!B168","v":"in trailer"},{"$f":"'Data source'!B180","v":"Utilisation 85%"}]
["FT4",null,{"$f":"'Data source'!B124","v":"grazing - very poor conditions"},{"$f":"'Data source'!B131","v":"in a bale feeder"},{"$f":"'Data source'!B137","v":""},{"$f":"'Data source'!B150","v":"in paddock good conditions"},{"$f":"'Data source'!B181","v":"Utilisation 80%"},{"$f":"'Data source'!B181","v":"Utilisation 80%"},{"$f":"'Data source'!B158","v":"dusted - good conditions"},{"$f":"'Data source'!B169","v":"in paddock good conditions"},{"$f":"'Data source'!B181","v":"Utilisation 80%"}]
["FT5",null,{"$f":"'Data source'!B125","v":""},{"$f":"'Data source'!B132","v":""},{"$f":"'Data source'!B138","v":""},{"$f":"'Data source'!B151","v":"in paddock wet conditions"},{"$f":"'Data source'!B182","v":"Utilisation 75%"},{"$f":"'Data source'!B182","v":"Utilisation 75%"},{"$f":"'Data source'!B159","v":"dusted - wet conditions"},{"$f":"'Data source'!B170","v":"in paddock wet conditions"},{"$f":"'Data source'!B182","v":"Utilisation 75%"}]
["FT6",null,{"$f":"'Data source'!B126","v":""},null,null,{"$f":"'Data source'!B152","v":" "},{"$f":"'Data source'!B145","v":""},{"$f":"'Data source'!B183","v":"Utilisation 70%"},{"$f":"'Data source'!B160","v":"in water"},{"$f":"'Data source'!B171","v":"grazing - very good conditions"},{"$f":"'Data source'!B183","v":"Utilisation 70%"}]
["FT7",null,null,null,null,null,null,{"$f":"'Data source'!B184","v":"Utilisation 65%"},{"$f":"'Data source'!B161","v":"in slurry"},{"$f":"'Data source'!B172","v":"grazing - good conditions"},{"$f":"'Data source'!B184","v":"Utilisation 65%"}]
["FT8",null,null,null,null,null,null,{"$f":"'Data source'!B185","v":"Utilisation 60%"},{"$f":"'Data source'!B162","v":"loose lick"},{"$f":"'Data source'!B173","v":"grazing - wet conditions"},{"$f":"'Data source'!B185","v":"Utilisation 60%"}]
[null,null,null,null,null,null,null,{"$f":"'Data source'!B186","v":"Utilisation 55%"},{"$f":"'Data source'!B163","v":" "},{"$f":"'Data source'!B174","v":"grazing - very poor conditions"},{"$f":"'Data source'!B186","v":"Utilisation 55%"}]
[null,null,null,null,null,null,null,{"$f":"'Data source'!B187","v":""},{"$f":"'Data source'!B164","v":" "},"in bale feeder",{"$f":"'Data source'!B187","v":""}]
[null,null,null,null,null,null,null,null,null,{"$f":"'Data source'!B176","v":""}]

{"sheet":"Sheet1","index":13,"n_rows":59,"n_cols":29,"rows_kept":59,"cut":false,"hidden":true,"merged":[]}
[]
[]
[]
[null,null,null,null,null," The 5 Step Approach",null,null,null,null,null,null,null,null,null,null,null,null,null,null,null,null,null,null,null," The 1 Step Quick Check"]
[]
[]
[]
[]
[]
[]
[]
[]
[]
[]
[]
[]
[]
[]
[]
[]
[]
[]
[]
[]
[]
[]
[]
[]
[]
[]
[null,null,null,null,null,null,null,"GREEN",null,null,null,null,null,"GREY",null,null,null,"TEAL",null,null,null,null,"CREAM"]
[]
[]
[]
[null,null,null,null,0]
[]
[]
[]
[]
[null,null,null,null,null,null,null,null,null,null,null,null,"104-105-104"]
[null,null,null,null,0.25]
[]
[]
[]
[]
[null,null,"HEADING COLOUR",null,0.4,null,"165-216-126",null,null,"`",null,null,"132=133-132"]
[]
[]
[null,null,null,null,0.6]
[null,null,null,null,null,null,"195-229-169"]
[]
[null,null,null,null,0.75]
[null,null,null,null,null,null,null,null,null,null,null,null,"204-205=204",null,null,null,"191-230-233",null,null,null,null,"79-129-189"]
[]
[null,null,null,null,null,null,null,null,null,null,null,null,null,null,null,null,null,null,null,null,null,null,null,null,null,null,null,null,40]
[]
[null,null,"LINE COLOUR",null,0.9]
[]
[null,null,null,null,null,null,null,"240-248-233",null,null,null,null,"234-235-234",null,null,null,null,null,null,null,null,null,"251-251-250"]