{"text_format":"1","workbook":"xlsx","n_sheets":14,"sheets":["How to use","FEEDCHECKER","CUSTOM FEED SET-UP","   ASK    ","OBSERVE","ASSESS & COMPARE","SUMMARISE 2","SUMMARISE","Not so QUICK CHECK","Extra info","Sheet2","Data source","Drop down list set up","Sheet1"],"not_rendered":{"charts":0,"images":30,"macros":1,"external_links":0,"defined_names":39,"comments":3,"pivot_tables":0},"unopened":[],"bounds":{"document_bytes":16777216,"sheet_cells":100000,"rows_first":2000,"rows_last":500,"rows_between":2000,"halvings":0,"cell_chars":16384,"cell_head_chars":4096},"cells_cut":0,"cells_raw":0,"read":"whole","date_system":"1900"}

{"sheet":"How to use","index":0,"n_rows":19,"n_cols":9,"rows_kept":19,"cut":false,"hidden":false,"merged":[[1,2,2,22],[8,2,8,21],[5,2,5,21],[9,2,9,21],[30,23,31,31],[46,23,47,31],[48,22,51,30],[74,24,75,36],[102,24,103,36],[58,28,59,36],[62,30,63,38],[71,24,72,36],[68,24,69,36]]}
[]
[null,null,"Note: FEEDCHECKER has been prepared with due care. Results, however, will vary from situation to situation and outputs should be viewed as estimates. This information is intended as a general guide and a tool to support feed management decisions. DairyNZ accepts no liability for decisions made based on this information."]
[]
[]
[null,null,"Who is the FEEDCHECKER spreadsheet targetted at? "]
[null,null,"This tool has been developed to enable farmers and their advisors to assess current and proposed diets."]
{"$rows_left_out":14}
{"sheet":"FEEDCHECKER","index":1,"n_rows":93,"n_cols":99,"rows_kept":93,"cut":false,"hidden":false,"merged":[[69,14,70,14],[40,1,41,1],[43,1,44,1],[49,2,50,2],[40,7,41,8],[52,12,53,12],[43,7,44,8],[52,10,53,10],[46,10,47,10],[40,10,41,10],[52,9,53,9],[40,9,41,9],[43,9,44,9],[46,1,47,1],[52,1,53,1],[52,2,53,2],[67,14,68,14],[55,14,56,14],[67,12,68,12],[40,12,41,12],[43,12,44,12],[46,14,47,14],[49,14,50,14],[58,10,59,10],[39,46,40,46],[42,46,43,46],[33,21,34,30],[36,22,36,24],[40,23,41,23],[43,23,44,23],[40,22,41,22],[66,46,67,46],[54,40,55,40],[54,43,55,43],[51,39,52,39],[54,39,55,39],[57,39,58,39],[48,37,49,37],[48,36,49,36],[57,37,58,37],[57,42,58,42],[60,42,61,42],[36,46,37,46],[60,37,61,37],[60,40,61,40],[60,43,61,43],[48,43,49,43],[60,36,61,36],[34,48,34,52],[34,54,34,63],[36,54,36,55],[36,56,36,57],[36,58,36,59],[36,60,36,61],[36,62,36,63],[34,42,34,43],[34,75,34,78],[71,36,71,37],[69,42,69,43],[69,39,69,40],[70,22,71,22],[70,23,71,23],[70,26,71,26],[70,28,71,28],[64,22,65,22],[64,23,65,23],[70,24,71,24],[66,37,67,37],[66,40,67,40],[66,43,67,43],[66,39,67,39],[66,36,67,36],[63,39,64,39],[73,22,74,22],[84,27,85,27],[81,23,82,23],[89,22,89,27],[92,22,93,22],[92,23,93,23],[92,25,93,25],[92,26,93,26],[92,28,93,28],[81,26,82,26],[81,28,82,28],[84,22,85,22],[84,23,85,23],[84,25,85,25],[84,26,85,26],[73,23,74,23],[84,24,85,24],[86,24,87,24],[81,24,82,24],[79,24,80,24],[76,24,77,24],[73,24,74,24],[86,23,87,23],[86,26,87,26],[86,28,87,28],[76,22,77,22],[76,23,77,23],[76,25,77,25],[76,26,77,26],[76,28,77,28],[79,22,80,22],[79,23,80,23],[79,25,80,25],[79,26,80,26],[79,28,80,28],[79,27,80,27],[63,46,64,46],[51,46,52,46],[54,46,55,46],[57,46,58,46],[60,46,61,46],[57,36,58,36],[63,43,64,43],[64,24,65,24],[64,28,65,28],[64,27,65,27],[58,29,59,29],[64,25,65,25],[54,42,55,42],[54,36,55,36],[45,46,46,46],[45,39,46,39],[45,43,46,43],[54,37,55,37],[49,25,50,25],[49,26,50,26],[49,27,50,27],[49,28,50,28],[48,46,49,46],[48,40,49,40],[48,42,49,42],[48,39,49,39],[55,28,56,28],[55,29,56,29],[52,25,53,25],[52,26,53,26],[52,27,53,27],[52,28,53,28],[49,29,50,29],[55,25,56,25],[55,26,56,26],[55,27,56,27],[48,95,48,96],[5,2,5,6],[67,4,68,5],[46,2,47,2],[67,7,68,8],[6,2,6,6],[7,2,7,6],[64,4,65,5],[40,2,41,2],[43,2,44,2],[64,2,65,2],[61,2,62,2],[40,4,41,5],[43,4,44,5],[57,40,58,40],[57,43,58,43],[52,14,53,14],[51,42,52,42],[51,36,52,36],[52,16,53,16],[55,16,56,16],[58,16,59,16],[61,16,62,16],[32,35,32,38],[45,98,45,99],[46,4,47,5],[58,4,59,5],[61,4,62,5],[45,92,45,93],[45,95,45,96],[55,7,56,8],[54,92,54,93],[54,95,54,96],[54,98,54,99],[52,7,53,8],[51,92,51,93],[51,95,51,96],[51,98,51,99],[49,7,50,8],[48,98,48,99],[46,7,47,8],[58,7,59,8],[55,4,56,5],[52,4,53,5],[49,4,50,5],[48,92,48,93],[61,7,62,8],[60,39,61,39],[10,73,10,74],[8,2,8,6],[9,2,9,6],[35,10,35,12],[35,14,35,16],[14,4,14,7],[37,9,38,9],[37,12,38,12],[36,43,37,43],[37,2,38,2],[37,7,38,8],[37,4,38,5],[37,10,38,10],[36,39,37,39],[37,14,38,14],[36,42,37,42],[12,1,12,7],[37,16,38,16],[36,37,37,37],[36,40,37,40],[36,36,37,36],[34,39,34,40],[34,65,34,71],[34,35,34,38],[75,41,76,41],[75,42,76,42],[75,43,76,43],[40,16,41,16],[43,16,44,16],[46,16,47,16],[49,16,50,16],[45,42,46,42],[45,36,46,36],[45,37,46,37],[45,40,46,40],[46,26,47,26],[46,27,47,27],[46,28,47,28],[46,29,47,29],[49,22,50,22],[49,23,50,23],[71,42,71,43],[42,43,43,43],[63,37,64,37],[63,40,64,40],[51,37,52,37],[51,40,52,40],[69,16,70,16],[69,12,70,12],[64,14,65,14],[55,10,56,10],[72,39,72,40],[74,39,74,43],[72,42,72,43],[42,39,43,39],[42,42,43,42],[42,36,43,36],[42,37,43,37],[42,40,43,40],[43,26,44,26],[43,27,44,27],[43,29,44,29],[43,28,44,28],[71,39,71,40],[64,29,65,29],[51,43,52,43],[63,42,64,42],[66,42,67,42],[63,36,64,36],[58,28,59,28],[67,23,68,23],[72,36,72,37],[71,4,71,8],[69,10,70,10],[64,1,65,1],[61,10,62,10],[64,10,65,10],[67,10,68,10],[61,1,62,1],[67,1,68,1],[67,2,68,2],[67,9,68,9],[61,3,62,3],[64,3,65,3],[67,3,68,3],[71,2,72,2],[61,9,62,9],[64,9,65,9],[72,4,72,8],[64,7,65,8],[46,23,47,23],[15,22,15,28],[16,22,16,29],[43,22,44,22],[64,16,65,16],[67,16,68,16],[55,22,56,22],[67,22,68,22],[58,26,59,26],[58,27,59,27],[58,22,59,22],[52,29,53,29],[52,23,53,23],[58,23,59,23],[58,25,59,25],[67,24,68,24],[64,26,65,26],[52,22,53,22],[55,23,56,23],[40,24,41,24],[43,24,44,24],[1,4,1,7],[49,3,50,3],[46,3,47,3],[43,3,44,3],[4,1,4,7],[58,1,59,1],[55,1,56,1],[55,2,56,2],[43,14,44,14],[46,9,47,9],[49,9,50,9],[58,12,59,12],[46,12,47,12],[17,14,18,14],[24,1,24,7],[55,3,56,3],[58,3,59,3],[40,14,41,14],[2,13,2,15],[49,1,50,1],[1,2,1,3],[19,9,19,12],[43,10,44,10],[49,10,50,10],[61,12,62,12],[64,12,65,12],[52,3,53,3],[27,12,27,16],[55,9,56,9],[58,9,59,9],[58,2,59,2],[2,4,2,5],[79,29,80,29],[58,14,59,14],[61,14,62,14],[49,12,50,12],[55,12,56,12],[46,24,47,24],[40,26,41,26],[40,27,41,27],[40,28,41,28],[40,29,41,29],[37,3,38,3],[37,6,38,6],[2,28,2,29],[18,22,18,24],[14,22,14,28],[46,22,47,22],[84,29,85,29],[73,25,74,25],[70,25,71,25],[67,25,68,25],[67,27,68,27],[70,27,71,27],[73,27,74,27],[76,27,77,27],[67,29,68,29],[70,29,71,29],[73,29,74,29],[73,26,74,26],[73,28,74,28],[84,28,85,28],[67,26,68,26],[67,28,68,28]]}
[]
[null,null,"NAME "]
[null,null,null,"Calcs from Today ",{"$f":"TODAY()","v":"2022-12-06"},null,null,null,null,null,"Calcs from a different date?",null,null,null,null,null,{"$f":"IF(I4=\"\",\"i\",\"\")","v":"i"},null,null,null,null,null,"ENERGY REQUIREMENTS",null,null,null,null,null,"MJME/cow",null,null,null,null,null,null,null,null,null,null,null,null,null,null,null,null,null,null,null,null,null,null,null,null,null,null,null,null,null,null,null,null,null,null,null,null,null,null,null,null,null,null,null,null,null,null,null,null,null,null,null,null,null,null,null,null,null,null,null,null,null,null,null,null,null,"Cell",null,"Option 1",null,"Option 2"]
[null,null,null,null,null,null,null,null,null,null,null,null,null,null,null,null,null,null,null,null,null,null,"maintenance",null,null,null,null,null,null,{"$f":"IF($H$8=\"\",\"\",VLOOKUP($H$8,'Data source'!$B$190:$C$199,2,FALSE))","v":""},null,null,null,null,null,null,null,null,null,null,null,null,null,null,null,null,null,null,null,null,null,null,null,null,null,null,null,null,null,null,null,null,null,null,null,null,null,null,null,null,null,null,null,null,null,null,null,null,null,null,null,null,null,null,null,null,null,null,null,null,null,null,null,null,"AB42 & AD42","Average ME of diet (MJ ME)",{"$f":"IF(OR($AA$44=\"\",$AA41=\"\"),11,$AA$44/$AA41)","v":11},null,{"$f":"IF(OR($AC$44=\"\",$AC41=\"\"),11,$AC$44/$AC41)","v":11}]
[null,"1. HERD/MOB INPUTS",null,null,null,null,null,null,null,null,null,null,null,null,null,null,null,null,null,null,null,null,"total MS production",null,null,null,null,null,null,{"$f":"IF($H$7=\"Dry\",0,IF(OR($H$6=\"\",$O$7=\"\"),\"\",$O$7*$CJ$11))","v":""},null,null,null,null,null,null,null,null,null,null,null,null,null,null,null,null,null,null,null,null,null,null,null,null,null,null,null,null,null,null,null,null,null,null,null,null,null,null,null,null,null,null,null,null,null,null,null,null,null,null,null,null,null,null,null,null,"Energy requirements calcs",null,null,null,null,null,null,null,"Y40 & Z40","Total DMI requirements (kg DM)",{"$f":"IF(OR($AD$11=\"\",CS4=\"\"),\"\",$AD$11/$CS$4)","v":""},null,{"$f":"IF(OR($AE$11=\"\",CU4=\"\"),\"\",$AE$11/$CU$4)","v":""}]
[null,null,"Breed",null,null,null,null,null,null,"Cows in mob",null,null,null,null,null,null,null,null,null,null,null,null,"daily BCS gain/loss",null,null,null,null,null,null,{"$f":"IF(OR($H$7=\"\",$H$8=\"\",$H$9=\"\"),\"\",IF($H$9<0,$CO$8,IF($H$9>0,$CO$9,0)))","v":""},null,null,null,null,null,null,null,null,null,null,null,null,null,null,null,null,null,null,null,null,null,null,null,null,null,null,null,null,null,null,null,null,null,null,null,null,null,null,null,null,null,null,null,null,null,null,null,null,null,null,null,null,null,null,null,"Cell",null,"Option 1","Option 2",null,null,null,"Option 1","Option 2","AC43 & AE43","Difference in ME  intake (MJ)",{"$f":"IF(OR(AA$44=\"\",$AD$11=\"\"),\"\",AA$44-$AD$11)","v":""},null,{"$f":"IF(OR(AC$44=\"\",$AE$11=\"\"),\"\",AC$44-CU9)","v":""}]
{"$rows_left_out":88}
{"sheet":"CUSTOM FEED SET-UP","index":2,"n_rows":43,"n_cols":24,"rows_kept":43,"cut":false,"hidden":false,"merged":[]}
[null,null,"%bulb","%leaf"]
["Custom fodder beet ratio","Custom: Bulb% & Leaf%",null,null,"Use this with default fodder beet feeding values"]
["FODDER BEET DEFAULT",null,null,null,"DM ","ME","CP","NDF","SSS","starch","fat","BP P","Sol P","Degrad P","Dry/Wet","Na","K","Cl","S","Mg","Ca","P"]
[null,"Fodder beet_Default","%bulb","%leaf","%","MJ/kg DM","%DM","%DM","%DM","%SSS","%DM","%CP","%CP","%CP","$","%DM","%DM","%DM","%DM","%DM","%DM","%DM"]
[null,"Bulb only",100,{"$f":"100-C5","v":0},{"$f":"'Data source'!C46","v":10},{"$f":"'Data source'!D46","v":12},{"$f":"'Data source'!E46","v":8.6},{"$f":"'Data source'!F46","v":11.4},{"$f":"'Data source'!G46","v":64},{"$f":"'Data source'!H46","v":5},{"$f":"'Data source'!I46","v":0},{"$f":"'Data source'!J46","v":0},{"$f":"'Data source'!K46","v":0},{"$f":"'Data source'!L46","v":0},{"$f":"'Data source'!M46","v":"Dry"},{"$f":"'Data source'!N46","v":0.3},{"$f":"'Data source'!O46","v":2},{"$f":"'Data source'!P46","v":0.3},{"$f":"'Data source'!Q46","v":7.0000000000000007E-2},{"$f":"'Data source'!R46","v":0.16},{"$f":"'Data source'!S46","v":0.14000000000000001},{"$f":"'Data source'!T46","v":0.13}]
[null,"Leaf only",0,100,{"$f":"'Data source'!C47","v":17},{"$f":"'Data source'!D47","v":10.4},{"$f":"'Data source'!E47","v":20},{"$f":"'Data source'!F47","v":32},{"$f":"'Data source'!G47","v":17.5},{"$f":"'Data source'!H47","v":0},{"$f":"'Data source'!I47","v":0},{"$f":"'Data source'!J47","v":0},{"$f":"'Data source'!K47","v":0},{"$f":"'Data source'!L47","v":0},{"$f":"'Data source'!M47","v":"Dry"},{"$f":"'Data source'!N47","v":1.3},{"$f":"'Data source'!O47","v":3.2},{"$f":"'Data source'!P47","v":0.3},{"$f":"'Data source'!Q47","v":0.3},{"$f":"'Data source'!R47","v":1},{"$f":"'Data source'!S47","v":1.8},{"$f":"'Data source'!T47","v":0.3}]
{"$rows_left_out":38}
{"sheet":"   ASK    ","index":3,"n_rows":36,"n_cols":35,"rows_kept":36,"cut":false,"hidden":true,"merged":[[33,12,33,14],[34,12,34,14],[33,18,33,20],[32,18,32,20],[35,12,35,14],[4,1,4,5],[4,13,4,17],[4,7,4,11],[4,19,4,26],[32,12,32,14]]}
[null,null,null,null,null,null,null,null,null,null,"Today",null,null,null,null,null,"Calcs from this date (optional)"]
[null,null,null,null,"FARM  INPUTS",null,null,null,null,null,{"$f":"TODAY()","v":"2022-12-06"}]
[]
[]
[null,"FARM",null,null,null,null,null,"COWS",null,null,null,null,null,"PASTURE",null,null,null,null,null,"SUPPLEMENT ON HAND/CONTRACT"]
[]
{"$rows_left_out":31}
{"sheet":"OBSERVE","index":4,"n_rows":0,"n_cols":0,"rows_kept":0,"cut":false,"hidden":true,"merged":[]}

{"sheet":"ASSESS & COMPARE","index":5,"n_rows":74,"n_cols":89,"rows_kept":74,"cut":false,"hidden":true,"merged":[[12,1,12,5],[5,21,5,25],[1,1,1,2],[1,21,1,26],[4,1,4,5],[4,21,4,26],[2,13,2,14],[24,6,24,7],[6,21,6,25],[7,21,7,25],[8,21,8,25],[11,50,11,56],[23,29,23,30],[23,32,23,33],[23,35,23,36],[23,38,23,39],[23,41,23,42],[13,64,13,65],[22,1,22,5],[22,44,22,47],[22,50,22,56],[22,59,22,66],[13,6,13,7],[26,1,27,1],[26,2,27,2],[26,4,27,4],[26,6,27,7],[38,1,39,1],[38,2,39,2],[38,4,39,4],[38,6,39,7],[32,1,33,1],[32,2,33,2],[32,4,33,4],[32,6,33,7],[29,1,30,1],[29,2,30,2],[29,4,30,4],[29,6,30,7],[32,88,32,89],[35,1,36,1],[35,2,36,2],[35,4,36,4],[35,6,36,7],[32,82,32,83],[32,85,32,86],[48,6,48,7],[41,1,42,1],[41,2,42,2],[41,4,42,4],[41,6,42,7],[44,1,45,1],[44,2,45,2],[44,4,45,4],[44,6,45,7]]}
[]
[null," INPUTS",null,null,null,null,"Today",null,null,null,null,null,"Calcs from this date",null,null,null,null,null,null,null,null,"CALCULATIONS"]
[null,null,null,null,null,null,{"$f":"TODAY()","v":"2022-12-06"},null,null,null,null,null,null,"2017-05-22",null,null,null,null,null,null,null,null,null,null,null,null,null,null,null,null,null,null,null,"KEY",null,null,null,"ENERGY REQUIREMENTS"]
[null,null,null,null,null,null,null,null,null,null,null,null,null,null,null,null,null,null,null,null,null,null,null,null,null,null,null,null,null,null,null,null,null,null,null,null,null,null,null,null,null,null,"MJME/cow",null,null,null,null,null,null,null,null,null,null,null,null,null,null,null,null,null,null,null,null,null,null,null,null,null,null,null,null,null,null,null,null,null,"Background calcs (these could be hidden or somewhere else)"]
[null,"MOB INPUTS",null,null,null,null,null,null,null,null,null,null,null,null,null,null,null,null,null,null,null,"CALCULATION OPTIONS",null,null,null,null,null,null,"Select from drop down list",null,null,null,null,null,"Jersey",null,null,"maintenance",null,null,null,null,{"$f":"IF($J$53=\"Yes\",VLOOKUP(G8,'Data source'!$B$190:$C$199,2,FALSE),\"\")","v":""}]
[null,null,"Breed",null,null,null,{"$f":"IF('   ASK    '!K8=\"\",\"\",'   ASK    '!K8)","v":"Friesian"},null,"Cows in mob",null,null,null,null,null,150,null,null,null,null,null,null,"COMPARE TWO FEEDING OPTIONS",null,null,null,null,"YES",null,"Enter values - Option 1",null,null,null,null,null,2,null,null,"total MS production",null,null,null,null,{"$f":"IF($J$53=\"Yes\",$O$7*$BZ$12,\"\")","v":""}]
{"$rows_left_out":69}
{"sheet":"SUMMARISE 2","index":6,"n_rows":34,"n_cols":24,"rows_kept":34,"cut":false,"hidden":true,"merged":[[28,22,28,23],[4,20,4,21],[4,22,4,23]]}
[]
[]
[null,"FARM & MOB INFO"]
[]
[null,null,"FARM",null,null,null,null,null,null,"FEED TYPE",null,"FEED",null,null,null,"FEEDING METHOD",null,null,null,"ON-HAND","OPTION 1",null,"OPTION 2"]
[null,null,"Platform Sixe (Effective ha)",null,null,null,{"$f":"IF('   ASK    '!E8=\"\",\"-\",'   ASK    '!E8)","v":100},null,null,null,null,null,null,null,null,null,null,null,null,null,"kg DM","Tonne","kg DM","Tonne"]
{"$rows_left_out":29}
{"sheet":"SUMMARISE","index":7,"n_rows":42,"n_cols":19,"rows_kept":42,"cut":false,"hidden":true,"merged":[[22,8,22,10],[19,15,19,16],[3,15,3,19],[19,13,19,14],[5,16,5,17],[6,16,6,17],[7,16,7,17],[8,16,8,17],[9,16,9,17],[10,16,10,17]]}
[]
[null,"FARM INFO",null,null,"TODAY",{"$f":"'   ASK    '!K2","v":"2022-12-06"},null,"Date for calculations",null,{"$f":"IF('   ASK    '!$Q$2=\"\",$F$2,'   ASK    '!$Q$2)","v":"2022-12-06"}]
[]
[null,null,"FARM",null,null,null,null,"COWS",null,null,null,"PASTURE",null,null,null,"CROPS/FORAGE/SUPPLEMENT on hand/contract"]
[null,null,null,null,null,null,null,null,null,null,null,null,null,null,null,null,null,null,"tonne"]
[null,null,{"$f":"'   ASK    '!E7","v":"PLATFORM SIZE (Effective Ha)"},null,null,{"$f":"IF('   ASK    '!$E$8=\"\",\"-\",'   ASK    '!$E$8)","v":100},null,{"$f":"'   ASK    '!K7","v":"BREED"},null,{"$f":"IF('   ASK    '!$K$8=\"\",\"-\",'   ASK    '!$K$8)","v":"Friesian"},null,{"$f":"'   ASK    '!Q7","v":"CURRENT TOTAL GRAZABLE AREA (ha)"},null,{"$f":"IF('   ASK    '!$Q$8=\"\",\"-\",'   ASK    '!$Q$8)","v":90},null,"Feed 1",{"$f":"IF('   ASK    '!$Y$8=\"\",\"-\",'   ASK    '!$Y$8)","v":"Hay pasture good"},null,{"$f":"IF('   ASK    '!$AA$8=\"\",\"-\",'   ASK    '!$AA$8)","v":14}]
{"$rows_left_out":37}
{"sheet":"Not so QUICK CHECK","index":8,"n_rows":67,"n_cols":76,"rows_kept":67,"cut":false,"hidden":true,"merged":[[31,75,31,76],[33,3,33,4],[31,3,31,4],[31,63,31,64],[15,3,15,4],[29,3,29,4],[21,27,21,28],[21,57,21,58],[21,54,21,55],[21,51,21,52],[31,72,31,73],[31,69,31,70],[31,66,31,67],[20,48,20,59],[49,3,49,4],[55,19,55,54],[37,3,37,4],[39,3,39,4],[41,3,41,4],[43,3,43,4],[45,3,45,4],[47,3,47,4],[35,3,35,4],[23,3,23,4],[25,3,25,4],[27,3,27,4],[21,24,21,25],[1,30,1,31],[56,19,56,57],[57,19,57,57],[58,19,58,57],[59,19,59,57],[2,49,2,54],[21,30,21,31],[21,33,21,34],[21,36,21,37]]}
[]
[null," INPUTS",null,null,null,null,null,null,null,null,null,null,null,null,null,null,null,"CALCULATIONS",null,null,null,null,"ENERGY REQUIREMENTS",null,null,null,null,null,"OPTION 1",null,"OPTION 2",null,null,null,null,null,null,null,null,null,null,"KEY"]
[null,null,null,null,null,null,null,null,null,null,null,null,null,null,null,null,null,null,null,null,null,null,null,null,null,null,null,null,"MJME",null,null,"MJME",null,null,null,null,null,null,null,null,null,null,null,null,null,null,null,null,null,null,null,null,null,null,null,null,null,null,null,null,null,null,null,"Background calcs (these could be hidden or somewhere else)"]
[null,null,null,null,null,null,null,null,null,null,null,null,null,null,null,null,null,null,null,null,null,null,"maintenance",null,null,null,null,null,{"$f":"VLOOKUP('   ASK    '!$K$11,'Data source'!$B$190:$C$199,2,FALSE)","v":68},null,null,{"$f":"VLOOKUP('   ASK    '!$K$11,'Data source'!$B$190:$C$199,2,FALSE)","v":68},null,null,null,null,"Feed selection fron drop down list"]
[null,null,null,null,null,null,null,null,null,null,null,null,null,null,null,null,null,null,null,null,null,null,"total MS production",null,null,null,null,null,{"$f":"$G$9*$BM$11","v":{"$error":"#N/A"}},null,null,{"$f":"$K$9*$BN$11","v":{"$error":"#N/A"}},null,null,null,null,"Option 1  drop-down or enter values"]
[null,"MOB INPUTS",null,null,null,null,"OPTION 1",null,"OPTION 2",null,null,null,null,null,null,null,null,null,null,null,null,null,"daily BCS gain/loss",null,null,null,null,null,{"$f":"IF($G$11<0,$BR$8,IF($G$11>0,$BR$9,0))","v":-4.8692000000000002},null,null,{"$f":"IF($K$11<0,$BS$8,IF($K$11>0,$BS$9,0))","v":0},null,null,null,null,"Option 2  drop-down or enter values",null,null,null,null,null,null,null,null,null,null,null,null,null,null,null,null,null,null,null,null,null,null,null,null,null,null,null,"Current","Proposed",null,null,null,"Current","Proposed",null,null,"Current",null,"Proposed"]
{"$rows_left_out":62}
{"sheet":"Extra info","index":9,"n_rows":5,"n_cols":3,"rows_kept":5,"cut":false,"hidden":false,"merged":[]}
["daily BCS gain"]
[]
["monthly BCS gain ",0.1,"BCS"]
["monthly LWT gain",{"$f":"33*B3","v":3.3000000000000003},"kg"]
["daily LWT gain",{"$f":"B4/31","v":0.10645161290322581},"kg"]

{"sheet":"Sheet2","index":10,"n_rows":0,"n_cols":0,"rows_kept":0,"cut":false,"hidden":true,"merged":[]}

{"sheet":"Data source","index":11,"n_rows":264,"n_cols":87,"rows_kept":264,"cut":false,"hidden":true,"merged":[]}
[null,"Supplement","DM ","ME","CP","NDF","SSS","starch","fat","BP P","Sol P","Degrad P","Dry/Wet","Na","K","Cl","S","Mg","Ca","P"]
["FEED",null,"%","MJ /kg DM","% DM","% DM","% DM","% SSS","% DM","% CP","% CP","% CP","$","%DM","%DM","%DM","%DM","%DM","%DM","%DM"]
["Pasture"]
[null,"Autumn and winter",16,11,17,44,16,3,4,0,0,0,"Dry",0.35,3.6,1.3,0.4,0.25,0.45,0.4]
[null,"Autumn & winter -Irrigated",17,12,25,43,19,3,4,0,0,0,"Dry",0.35,3.6,1.3,0.4,0.25,0.45,0.4]
[null,"Spring",14.000000000000002,12,27,41,16,3,4,25,37.5,{"$f":"100-J6","v":75},"Dry",0.35,3.6,1.3,0.4,0.25,0.7,0.4,null,null,null,null,"kolver"]
{"$rows_left_out":259}
{"sheet":"Drop down list set up","index":12,"n_rows":29,"n_cols":11,"rows_kept":29,"cut":false,"hidden":true,"merged":[[1,3,1,7]]}
["Dependent drop-down lists"]
[null,null,null,"Add new feeds in the Data Source sheet - Coloured cells indicate spare spaces available in each section"]
["Named ranges",null,"Feeds"]
["Feed_Type","Code","Pasture","Hay_Silage","Concentrates","By_products","Fodder_beet_Default","Other_Crops_Default","Minerals","Custom_Feeds_Minerals","Custom_Bulb_Crops"]
[null,null,{"$f":"'Data source'!B4","v":"Autumn and winter"},{"$f":"'Data source'!B16","v":"Hay - pasture - good"},{"$f":"'Data source'!B29","v":"Barley"},{"$f":"'Data source'!B53","v":"Apple pomace"},{"$f":"'CUSTOM FEED SET-UP'!B5","v":"Bulb only"},{"$f":"'Data source'!B41","v":"Chicory"},{"$f":"'Data source'!B100","v":"limeflour "},{"$f":"'CUSTOM FEED SET-UP'!B34","v":"Custom feed 1"},{"$f":"'CUSTOM FEED SET-UP'!B17","v":" Bulb only"}]
["Hay_Silage","FT1",{"$f":"'Data source'!B5","v":"Autumn & winter -Irrigated"},{"$f":"'Data source'!B17","v":"Hay - pasture - poor"},{"$f":"'Data source'!B30","v":"Bran (wheat)"},{"$f":"'Data source'!B54","v":"Brewers grain"},{"$f":"'CUSTOM FEED SET-UP'!B7","v":"Bulb 90% Leaf 10%"},{"$f":"'Data source'!B42","v":"Kale"},{"$f":"'Data source'!B99","v":"Gypsum "},{"$f":"'CUSTOM FEED SET-UP'!B35","v":"Custom feed 2"},{"$f":"'CUSTOM FEED SET-UP'!B19","v":" Bulb 90% Leaf 10%"}]
{"$rows_left_out":24}
{"sheet":"Sheet1","index":13,"n_rows":59,"n_cols":29,"rows_kept":59,"cut":false,"hidden":true,"merged":[]}
[]
[]
[]
[null,null,null,null,null," The 5 Step Approach",null,null,null,null,null,null,null,null,null,null,null,null,null,null,null,null,null,null,null," The 1 Step Quick Check"]
[]
[]
{"$rows_left_out":53}